{"text_format":"1","workbook":"xlsx","n_sheets":13,"sheets":["Lookup","Inst","Sheet1","DataYY03","Avg. Costs","Dashboard $","Benchmark","water","Electric Matt","Gas Matt","Water Matt","ALL Matt","%"],"not_rendered":{"charts":4,"images":1,"macros":1,"external_links":0,"defined_names":10,"comments":3,"pivot_tables":12},"unopened":[],"bounds":{"document_bytes":16777216,"sheet_cells":100000,"rows_first":2000,"rows_last":500,"rows_between":2000,"halvings":0,"cell_chars":16384,"cell_head_chars":4096},"cells_cut":0,"cells_raw":0,"read":"whole","date_system":"1900"}

{"sheet":"Lookup","index":0,"n_rows":127,"n_cols":3,"rows_kept":127,"cut":false,"hidden":false,"merged":[]}
["Administration","Electric","BARKERTRANS"]
["Administration","Electric","BERRYCENTER"]
["Administration","Electric","BRADLEYPOLICESTATION"]
["Administration","Electric","CFISDNATATORIUM"]
["Administration","Electric","CY-FAIRCOMPLEXRETENTIONPOND"]
["Administration","Electric","CY-FAIRHS-BALLFIELD"]
["Administration","Electric","ELC1"]
["Administration","Electric","ELC2"]
["Administration","Electric","ELDRIDGETRANS"]
["Administration","Electric","EXHIBITCENTERSCIENCERESOURCEC"]
["Administration","Electric","EXHIBITCENTERTELGEAG"]
["Administration","Electric","FALCONCOMPLEX"]
["Administration","Electric","FOODPRODUCTIONCENTER"]
["Administration","Electric","FOODSERVICEWAREHOUSE"]
["Administration","Electric","ISCA"]
["Administration","Electric","ISCB"]
["Administration","Electric","ISCC"]
["Administration","Electric","ISCC-EXLIGHT"]
["Administration","Electric","ISCD"]
["Administration","Electric","ISCDATACENTER"]
["Administration","Electric","ISCSW"]
["Administration","Electric","ISCW"]
["Administration","Electric","JARVISCENTRALPLANT"]
["Administration","Electric","JERSEYVILLAGESTADIUM"]
["Administration","Electric","LANGHAMCREEKRETENTIONPOND"]
["Administration","Electric","MAINTENANCEOPER"]
["Administration","Electric","MILLSAPNATURETRAIL"]
["Administration","Electric","MILLSAPROPES"]
["Administration","Electric","PRIDGEONSTADIUM"]
["Administration","Electric","RECYCLECENTER"]
["Administration","Electric","SATELLITECOLDFOODWAREHOUSE"]
["Administration","Electric","TELGETRANS"]
["Administration","Electric","WESTGREENAGSCIENCECENTER"]
["Administration","Electric","WESTGREENTRANS"]
["Elementary School","Electric","ADAM-ES"]
["Elementary School","Electric","ANDREES"]
["Elementary School","Electric","AULTES"]
["Elementary School","Electric","BANEES"]
["Elementary School","Electric","BANGES"]
["Elementary School","Electric","BIRKESES"]
["Elementary School","Electric","BLACKES"]
["Elementary School","Electric","COPELANDES"]
["Elementary School","Electric","DANISHES"]
["Elementary School","Electric","DURYEAES"]
["Elementary School","Electric","EMERYES"]
["Elementary School","Electric","EMMOTTES"]
["Elementary School","Electric","FARNEYES"]
["Elementary School","Electric","FIESTES"]
["Elementary School","Electric","FRANCONEES"]
["Elementary School","Electric","FRAZIERES"]
["Elementary School","Electric","GLEASONES"]
["Elementary School","Electric","HAIRGROVEES"]
["Elementary School","Electric","HAMILTONES"]
["Elementary School","Electric","HANCOCKES"]
["Elementary School","Electric","HEMMENWAYES"]
["Elementary School","Electric","HOLBROOKES"]
["Elementary School","Electric","HOLMSLEYES"]
["Elementary School","Electric","HOOVERES"]
["Elementary School","Electric","HORNEES"]
["Elementary School","Electric","JOWELLES"]
["Elementary School","Electric","KEITHES"]
["Elementary School","Electric","KIRKES"]
["Elementary School","Electric","LAMKINES"]
["Elementary School","Electric","LEEES"]
["Elementary School","Electric","LIEDERES"]
["Elementary School","Electric","LOWERYES"]
["Elementary School","Electric","MATZKEES"]
["Elementary School","Electric","MATZKEMILLSES"]
["Elementary School","Electric","MCFEEES"]
["Elementary School","Electric","METCALFES"]
["Elementary School","Electric","MILLSAPES"]
["Elementary School","Electric","MOOREES"]
["Elementary School","Electric","OWENSES"]
["Elementary School","Electric","POPEES"]
["Elementary School","Electric","POSTES"]
["Elementary School","Electric","POSTMAES"]
["Elementary School","Electric","REEDES"]
["Elementary School","Electric","RENNELLES"]
["Elementary School","Electric","ROBINSONES"]
["Elementary School","Electric","ROBISONES"]
["Elementary School","Electric","SAMPSONES"]
["Elementary School","Electric","SHERIDANES"]
["Elementary School","Electric","SWENKEES"]
["Elementary School","Electric","TIPPSES"]
["Elementary School","Electric","WALKERES"]
["Elementary School","Electric","WARNERES"]
["Elementary School","Electric","WELLSES"]
["Elementary School","Electric","WILLBERNES"]
["Elementary School","Electric","WILSONES"]
["Elementary School","Electric","WOODARDES"]
["Elementary School","Electric","YEAGERES"]
["High School","Electric","BRIDGELANDHS"]
["High School","Electric","CY-CREEKHS"]
["High School","Electric","CY-FAIRHS"]
["High School","Electric","CY-FALLSHS"]
["High School","Electric","CY-LAKESHS"]
["High School","Electric","CY-PARKHS"]
["High School","Electric","CY-RANCHHS"]
["High School","Electric","CY-RIDGEHS"]
["High School","Electric","CY-SPRINGSHS"]
["High School","Electric","CY-WOODSHS"]
["High School","Electric","JERSEYVILLAGEHS"]
["High School","Electric","LANGHAMCREEKHS"]
["Middle School","Electric","ANTHONYMS"]
["Middle School","Electric","ARAGONMS"]
["Middle School","Electric","ARNOLDMS"]
["Middle School","Electric","BLEYLMS"]
["Middle School","Electric","CAMPBELLMS"]
["Middle School","Electric","COOKMS"]
["Middle School","Electric","DEANMS"]
["Middle School","Electric","GOODSONMS"]
["Middle School","Electric","HAMILTONMS"]
["Middle School","Electric","HOPPERMS"]
["Middle School","Electric","KAHLAMS"]
["Middle School","Electric","LABAYMS"]
["Middle School","Electric","SALYARDSMS"]
["Middle School","Electric","SMITHMS"]
["Middle School","Electric","SPILLANEMS"]
["Middle School","Electric","THORNTONMS"]
["Middle School","Electric","TRUITTMS"]
["Middle School","Electric","WATKINSMS"]
["Special School","Electric","WINDFERNANNEX"]
["Special School","Electric","ALCABC"]
["Special School","Electric","ALCWEST"]
["Special School","Electric","WINDFERNHS"]
["Special School","Electric","BRAUTIGAMCENTER"]
["Middle School","nat Gas","ROWEMS"]

{"sheet":"Inst","index":1,"n_rows":3,"n_cols":4,"rows_kept":3,"cut":false,"hidden":false,"merged":[]}
["Use WD YY03 reports, paste values"]
["Make sure the total area closly resembles Dan Grozs Area (see Dan's spreadsheet)"]
["Refresh all pivot tables",null,"Start Here","End Here"]

{"sheet":"Sheet1","index":2,"n_rows":133,"n_cols":2,"rows_kept":133,"cut":false,"hidden":false,"merged":[]}
["School Type","(All)"]
[]
["Row Labels"]
["ADAM-ES"]
["ALCABC"]
["ALCWEST"]
["ANDREES"]
["ANTHONYMS"]
["ARAGONMS"]
["ARNOLDMS"]
["AULTES"]
["BANEES"]
["BANGES"]
["BARKERTRANS"]
["BERRYCENTER"]
["BIRKESES"]
["BLACKES"]
["BLEYLMS"]
["BRADLEYPOLICESTATION"]
["BRIDGELANDHS"]
["CAMPBELLMS"]
["CFISDNATATORIUM"]
["COOKMS"]
["COPELANDES"]
["CY-CREEKHS"]
["CY-FAIRCOMPLEX"]
["CY-FAIRCOMPLEXRETENTIONPOND"]
["CY-FAIRHS"]
["CY-FAIRHS-BALLFIELD"]
["CY-FALLSAGVOC"]
["CY-FALLSHS"]
["CY-LAKESHS"]
["CY-PARKHS"]
["CY-RANCHHS"]
["CY-RIDGEHS"]
["CY-SPRINGSHS"]
["CY-WOODSCARLTONCENTERKITCHEN"]
["CY-WOODSHS"]
["DANISHES"]
["DEANMS"]
["DURYEAES"]
["ELC1"]
["ELC2"]
["ELDRIDGETRANS"]
["EMERYES"]
["EMMOTTES"]
["EXHIBITCENTERSCIENCERESOURCEC"]
["EXHIBITCENTERTELGEAG"]
["FALCONCOMPLEX"]
["FARNEYES"]
["FIESTES"]
["FOODPRODUCTIONCENTER"]
["FOODSERVICEWAREHOUSE"]
["FRANCONEES"]
["FRAZIERES"]
["GLEASONES"]
["GOODSONMS"]
["HAIRGROVEES"]
["HAMILTONES"]
["HAMILTONMS"]
["HANCOCKES"]
["HEMMENWAYES"]
["HOLBROOKES"]
["HOLMSLEYES"]
["HOOVERES"]
["HOPPERMS"]
["HORNEES"]
["ISCA"]
["ISCB"]
["ISCC"]
["ISCC-EXLIGHT"]
["ISCD"]
["ISCDATACENTER"]
["ISCSW"]
["ISCW"]
["JARVISCENTRALPLANT"]
["JERSEYVILLAGEHS"]
["JERSEYVILLAGESTADIUM"]
["JOWELLES"]
["KAHLAMS"]
["KEITHES"]
["KIRKES"]
["LABAYMS"]
["LAMKINES"]
["LANGHAMCREEKHS"]
["LANGHAMCREEKRETENTIONPOND"]
["LEEES"]
["LIEDERES"]
["LOWERYES"]
["MAINTENANCEOPER"]
["MATZKEMILLSES"]
["MCFEEES"]
["METCALFES"]
["MILLSAPES"]
["MILLSAPNATURETRAIL"]
["MILLSAPROPES"]
["MOOREES"]
["OWENSES"]
["POPEES"]
["POSTES"]
["POSTMAES"]
["PRIDGEONSTADIUM"]
["RECYCLECENTER"]
["REEDES"]
["RENNELLES"]
["ROBINSONES"]
["ROBISONES"]
["SALYARDSMS"]
["SAMPSONES"]
["SATELLITECOLDFOODWAREHOUSE"]
["SHERIDANES"]
["SMITHMS"]
["SPILLANEMS"]
["SWENKEES"]
["TELGETRANS"]
["THORNTONMS"]
["TIPPSES"]
["TRUITTMS"]
["WALKERES"]
["WARNERES"]
["WATKINSMS"]
["WELLSES"]
["WESTGREENAGSCIENCECENTER"]
["WESTGREENTRANS"]
["WILLBERNES"]
["WILSONES"]
["WINDFERNANNEX"]
["WINDFERNHS"]
["WOODARDES"]
["YEAGERES"]
["BRAUTIGAMCENTER"]
["Fake"]
["Grand Total"]

{"sheet":"DataYY03","index":3,"n_rows":418,"n_cols":18,"rows_kept":418,"cut":false,"hidden":false,"merged":[]}
["School Type","Utility","f","Location","Area","Eff. Date","Base Year ","Mmbtus","Var [%]","Base Year 2","Cost","Var [%]3","Base Year 4","Current Year5","Var [%]6"]
[{"$f":"INDEX(Lookup!$A$1:$A$126,MATCH(DataYY03!C2,Lookup!$C$1:$C$126,0))","v":"Elementary School"},"Electric","ADAM-ES","Houston, TX",103177,"1901-01-01",3731.63616,3353.3136,-10.138248847926301,83845.05,78525.25,-6.3447991264839096,5925,5406,-8.75949367088608]
[{"$f":"INDEX(Lookup!$A$1:$A$126,MATCH(DataYY03!C3,Lookup!$C$1:$C$126,0))","v":"Special School"},"Electric","ALCABC","Houston, TX",56061,"1901-01-01",2507.0830080000001,2126.467584,-15.1816043898615,57548.75,48177.24,-16.284471860813699,4246,3311,-22.020725388601001]
[{"$f":"INDEX(Lookup!$A$1:$A$126,MATCH(DataYY03!C4,Lookup!$C$1:$C$126,0))","v":"Special School"},"Electric","ALCWEST","Katy, TX",50839,"1901-01-01",1845.100416,1986.2753279999999,7.6513403159950402,40143.019999999997,38604.03,-3.8337673647871999,2632,2082,-20.896656534954399]
[{"$f":"INDEX(Lookup!$A$1:$A$126,MATCH(DataYY03!C5,Lookup!$C$1:$C$126,0))","v":"Elementary School"},"Electric","ANDREES","Cypress, TX",106300,"2020-05-01",3862.4931839999999,3430.1245439999998,-11.194029850746301,83470.42,77047.820000000007,-7.6944623017351503,5450,5042,-7.4862385321100904]
[{"$f":"INDEX(Lookup!$A$1:$A$126,MATCH(DataYY03!C6,Lookup!$C$1:$C$126,0))","v":"Middle School"},"Electric","ANTHONYMS","Cypress, TX",244123,"1901-01-01",6930.3929840000001,6136.5195320000003,-11.4549557843659,148222.56,134142.70000000001,-9.4991342748364396,11233,9007,-19.8166117688952]
[{"$f":"INDEX(Lookup!$A$1:$A$126,MATCH(DataYY03!C7,Lookup!$C$1:$C$126,0))","v":"Middle School"},"Electric","ARAGONMS","Houston, TX",219821,"1901-01-01",7749.2798080000002,6806.8137559999996,-12.161982472578201,160667.82999999999,156677.74,-2.4834405244659101,10265,9845,-4.0915733073550902]
[{"$f":"INDEX(Lookup!$A$1:$A$126,MATCH(DataYY03!C8,Lookup!$C$1:$C$126,0))","v":"Middle School"},"Electric","ARNOLDMS","Cypress, TX",212235,"2020-05-01",7975.0518480000001,7444.577972,-6.65166679929529,145448.18,131737.76,-9.4263262696033703,6341,5700,-10.108815644220201]
[{"$f":"INDEX(Lookup!$A$1:$A$126,MATCH(DataYY03!C9,Lookup!$C$1:$C$126,0))","v":"Elementary School"},"Electric","AULTES","Cypress, TX",91912,"2020-05-01",1956.1405440000001,1851.3239040000001,-5.3583389149363603,45215.28,42943.22,-5.0249827049616904,2973,2875,-3.2963336696939098]
[{"$f":"INDEX(Lookup!$A$1:$A$126,MATCH(DataYY03!C10,Lookup!$C$1:$C$126,0))","v":"Elementary School"},"Electric","BANEES","Houston, TX",106804,"1901-01-01",3502.8410880000001,3209.3544959999999,-8.3785300168318706,81293.87,75120.38,-7.5940412235264496,5619,4962,-11.692471970101399]
[{"$f":"INDEX(Lookup!$A$1:$A$126,MATCH(DataYY03!C11,Lookup!$C$1:$C$126,0))","v":"Elementary School"},"Electric","BANGES","Houston, TX",89313,"2020-08-01",2500.85952,2399.6459519999999,-4.0471512770137403,57222.27,53737.17,-6.0904609341782496,3727,3501,-6.0638583310973999]
[{"$f":"INDEX(Lookup!$A$1:$A$126,MATCH(DataYY03!C12,Lookup!$C$1:$C$126,0))","v":"Administration"},"Electric","BARKERTRANS","Houston, TX",22677,"1901-01-01",1149.052416,1060.613376,-7.6966932725199397,22460.85,21157.16,-5.8042772201408201,1297,1208,-6.8619892058596799]
[{"$f":"INDEX(Lookup!$A$1:$A$126,MATCH(DataYY03!C13,Lookup!$C$1:$C$126,0))","v":"Administration"},"Electric","BERRYCENTER","Cypress, TX",491434,"1901-01-01",18486.700504,15252.895616,-17.492601707375002,359401.35,323876.95,-9.8843256988322405,18054,16009,-11.327129721945299]
[{"$f":"INDEX(Lookup!$A$1:$A$126,MATCH(DataYY03!C14,Lookup!$C$1:$C$126,0))","v":"Elementary School"},"Electric","BIRKESES","Houston, TX",104952,"2020-08-01",4208.3880959999997,4227.3861120000001,0.451432129514309,91267.09,91830.34,0.61714469038072794,6244,5851,-6.2940422805893697]
[{"$f":"INDEX(Lookup!$A$1:$A$126,MATCH(DataYY03!C15,Lookup!$C$1:$C$126,0))","v":"Elementary School"},"Electric","BLACKES","Cypress, TX",99456,"2020-08-01",3103.882752,2955.1741440000001,-4.7910510764035497,71456.06,69063.33,-3.34853335042542,5045,4696,-6.9177403369672996]
[{"$f":"INDEX(Lookup!$A$1:$A$126,MATCH(DataYY03!C16,Lookup!$C$1:$C$126,0))","v":"Middle School"},"Electric","BLEYLMS","Houston, TX",229363,"1901-01-01",6747.9021640000001,6594.9831480000003,-2.2661712082285801,140671.25,133101.68,-5.38103557052347,7303,6820,-6.6137203888812799]
[{"$f":"INDEX(Lookup!$A$1:$A$126,MATCH(DataYY03!C17,Lookup!$C$1:$C$126,0))","v":"Administration"},"Electric","BRADLEYPOLICESTATION","Cypress, TX",19680,"2020-05-01",1957.7783039999999,1952.8650239999999,-0.250962021080814,33906.99,33833.4,-0.21703489457483499,1507,1504,-0.19907100199071001]
[{"$f":"INDEX(Lookup!$A$1:$A$126,MATCH(DataYY03!C18,Lookup!$C$1:$C$126,0))","v":"Special School"},"Electric","BRAUTIGAMCENTER","Houston, TX",85895,43952,2646.5382719999998,2829.3293480000002,6.9067988902297097,57831.59,68263.7,18.038774310026799,3136,4612,47.066326530612201]
[{"$f":"INDEX(Lookup!$A$1:$A$126,MATCH(DataYY03!C19,Lookup!$C$1:$C$126,0))","v":"High School"},"Electric","BRIDGELANDHS","Cypress, TX",573468,"1901-01-01",18077.151320000001,17029.322708,-5.7964255177790003,378802.98,360504.21,-4.8306826942068897,25360,24410,-3.7460567823343802]
[{"$f":"INDEX(Lookup!$A$1:$A$126,MATCH(DataYY03!C20,Lookup!$C$1:$C$126,0))","v":"Middle School"},"Electric","CAMPBELLMS","Houston, TX",228967,"2020-08-01",8693.079952,8529.8874039999992,-1.87726960871278,185774.22,165320.09,-11.010209059147201,10789,10315,-4.3933636110853698]
[{"$f":"INDEX(Lookup!$A$1:$A$126,MATCH(DataYY03!C21,Lookup!$C$1:$C$126,0))","v":"Administration"},"Electric","CFISDNATATORIUM","Houston, TX",49471,"1901-01-01",12853.798996,11175.217828000001,-13.059027673626799,229066.48,208076.84,-9.1631215531840393,9206,8344,-9.3634586139474294]
[{"$f":"INDEX(Lookup!$A$1:$A$126,MATCH(DataYY03!C22,Lookup!$C$1:$C$126,0))","v":"Middle School"},"Electric","COOKMS","Houston, TX",205797,"2020-05-01",6967.9795759999997,5719.5424240000002,-17.916773985676201,142773.51,120222.25,-15.795128942336699,8169,8092,-0.94258783204798602]
[{"$f":"INDEX(Lookup!$A$1:$A$126,MATCH(DataYY03!C23,Lookup!$C$1:$C$126,0))","v":"Elementary School"},"Electric","COPELANDES","Houston, TX",86318,"1901-01-01",3193.6320000000001,3080.6265600000002,-3.5384615384615499,74828.91,72677.56,-2.87502517409381,5602,5149,-8.0863977151017501]
[{"$f":"INDEX(Lookup!$A$1:$A$126,MATCH(DataYY03!C24,Lookup!$C$1:$C$126,0))","v":"High School"},"Electric","CY-CREEKHS","Houston, TX",527749,"2020-05-01",19897.876408,16641.037108,-16.367773290071199,387714.03,346995.09,-10.5023127483934,22271,18068,-18.872075793633002,null,{"$f":"H24*1000000","v":16641037108},{"$f":"Q24/1000/3.412","v":4877209}]
[{"$f":"INDEX(Lookup!$A$1:$A$126,MATCH(DataYY03!C25,Lookup!$C$1:$C$126,0))","v":"Administration"},"Electric","CY-FAIRCOMPLEXRETENTIONPOND","Cypress, TX",0,"1901-01-01",3.8316759999999999,5.9744120000000001,55.921638468388203,1002.49,1338.86,33.553451904757203,116,157,35.344827586206897,null,null,0.18]
[{"$f":"INDEX(Lookup!$A$1:$A$126,MATCH(DataYY03!C26,Lookup!$C$1:$C$126,0))","v":"High School"},"Electric","CY-FAIRHS","Cypress, TX",507380,43861,23366.594084,22065.79638,-5.5669118885011102,416905.79,418622.59,0.41179567211095802,22785,20378,-10.5639675224929,null,null,{"$f":"R24*R25","v":877897.62}]
[{"$f":"INDEX(Lookup!$A$1:$A$126,MATCH(DataYY03!C27,Lookup!$C$1:$C$126,0))","v":"Administration"},"Electric","CY-FAIRHS-BALLFIELD","Cypress, TX",0,"1901-01-01",145.433088,116.936064,-19.5945945945946,17176.48,10593.71,-38.3243248907809,2304,1185,-48.5677083333333,null,null,7.0000000000000007E-2]
[{"$f":"INDEX(Lookup!$A$1:$A$126,MATCH(DataYY03!C28,Lookup!$C$1:$C$126,0))","v":"High School"},"Electric","CY-FALLSHS","Houston, TX",567967,"2020-05-01",15574.647215999999,14896.317732,-4.3553441345569999,318614.37,299903.40999999997,-5.8726039255542704,16460,14959,-9.1190765492102095,null,null,{"$f":"R26*R27","v":61452.833400000003}]
[{"$f":"INDEX(Lookup!$A$1:$A$126,MATCH(DataYY03!C29,Lookup!$C$1:$C$126,0))","v":"High School"},"Electric","CY-LAKESHS","Katy, TX",514068,"2020-05-01",20200.841536,20344.769931999999,0.71248712952627702,386366.43,369621.59,-4.3339272513919003,21996,19867,-9.6790325513729805]
[{"$f":"INDEX(Lookup!$A$1:$A$126,MATCH(DataYY03!C30,Lookup!$C$1:$C$126,0))","v":"High School"},"Electric","CY-PARKHS","Cypress, TX",{"$f":"590057+E418","v":764731},"1901-01-01",19319.10226,24297.496867999998,25.769285451258899,418133.42,505614.99,20.921927264268898,30334,30488,0.50768114986483803]
[{"$f":"INDEX(Lookup!$A$1:$A$126,MATCH(DataYY03!C31,Lookup!$C$1:$C$126,0))","v":"High School"},"Electric","CY-RANCHHS","Cypress, TX",527131,"2020-05-01",22826.737207999999,21376.749803999999,-6.3521448150366098,526022.68999999994,484117,-7.9665175660008103,39991,36641,-8.3768847990797894]
[{"$f":"INDEX(Lookup!$A$1:$A$126,MATCH(DataYY03!C32,Lookup!$C$1:$C$126,0))","v":"High School"},"Electric","CY-RIDGEHS","Houston, TX",502564,"2020-08-01",17884.134480000001,16719.032016000001,-6.5147265879874903,346177.65,324715.51,-6.19974744181203,19058,18952,-0.55619687270437601]
[{"$f":"INDEX(Lookup!$A$1:$A$126,MATCH(DataYY03!C33,Lookup!$C$1:$C$126,0))","v":"High School"},"Electric","CY-SPRINGSHS","Cypress, TX",478615,"2020-08-01",18138.348952,16588.065807999999,-8.5469915045881901,361916.91,307205.39,-15.117149403160001,18739,17930,-4.3171994236618803]
[{"$f":"INDEX(Lookup!$A$1:$A$126,MATCH(DataYY03!C34,Lookup!$C$1:$C$126,0))","v":"High School"},"Electric","CY-WOODSHS","Cypress, TX",535914,"1901-01-01",12107.420584,10387.523508,-14.2053137087915,227934.11,201961.35,-11.3948544164803,12959,11506,-11.2122848985261]
[{"$f":"INDEX(Lookup!$A$1:$A$126,MATCH(DataYY03!C35,Lookup!$C$1:$C$126,0))","v":"Elementary School"},"Electric","DANISHES","Houston, TX",98052,"2020-05-01",3787.6339039999998,3691.412092,-2.5404200732912199,83083.899999999994,85723.35,3.1768489442599601,4776,4778,4.1876046901172498E-2]
[{"$f":"INDEX(Lookup!$A$1:$A$126,MATCH(DataYY03!C36,Lookup!$C$1:$C$126,0))","v":"Middle School"},"Electric","DEANMS","Houston, TX",222788,"2020-08-01",7904.481452,7498.2692040000002,-5.1390119701934598,168256.08,164014.47,-2.5209252468023702,10109,9640,-4.6394302107033303]
[{"$f":"INDEX(Lookup!$A$1:$A$126,MATCH(DataYY03!C37,Lookup!$C$1:$C$126,0))","v":"Elementary School"},"Electric","DURYEAES","Katy, TX",96423,"2020-05-01",2910.6270720000002,2652.5160959999998,-8.86788206167002,69577.210000000006,65018.23,-6.5524041564759496,5167,4636,-10.2767563383008]
[{"$f":"INDEX(Lookup!$A$1:$A$126,MATCH(DataYY03!C38,Lookup!$C$1:$C$126,0))","v":"Administration"},"Electric","ELC1","Houston, TX",6832,"1901-01-01",254.39872,173.60256000000001,-31.759656652360501,6357.23,5087.84,-19.967658870294098,456,395,-13.3771929824561]
[{"$f":"INDEX(Lookup!$A$1:$A$126,MATCH(DataYY03!C39,Lookup!$C$1:$C$126,0))","v":"Administration"},"Electric","ELC2","Houston, TX",4573,"1901-01-01",165.946032,154.99351200000001,-6.6000493461633303,4933.93,4504.96,-8.69428629915706,389,352,-9.5115681233933191]
[{"$f":"INDEX(Lookup!$A$1:$A$126,MATCH(DataYY03!C40,Lookup!$C$1:$C$126,0))","v":"Administration"},"Electric","ELDRIDGETRANS","Houston, TX",26451,"1901-01-01",2409.4725119999998,2389.8193919999999,-0.81566068515497803,43795.78,43564.160000000003,-0.52886373983977497,2202,2167,-1.5894641235240701]
[{"$f":"INDEX(Lookup!$A$1:$A$126,MATCH(DataYY03!C41,Lookup!$C$1:$C$126,0))","v":"Elementary School"},"Electric","EMERYES","Katy, TX",98438,"2020-08-01",2903.7484800000002,2722.4348,-6.2441248354954002,69080.12,64002.2,-7.3507689332328896,5198,4440,-14.5825317429781]
[{"$f":"INDEX(Lookup!$A$1:$A$126,MATCH(DataYY03!C42,Lookup!$C$1:$C$126,0))","v":"Elementary School"},"Electric","EMMOTTES","Houston, TX",77394,"2020-05-01",2308.5864959999999,2096.3328000000001,-9.1940976163450596,57041.2,52436.11,-8.0732698470579205,4313,3780,-12.3579874797125]
[{"$f":"INDEX(Lookup!$A$1:$A$126,MATCH(DataYY03!C43,Lookup!$C$1:$C$126,0))","v":"Administration"},"Electric","EXHIBITCENTERSCIENCERESOURCEC","Cypress, TX",72198,"1901-01-01",3174.5248000000001,2713.7683200000001,-14.514187446259699,59183.66,52082.99,-11.997686523611399,3172,2869,-9.5523329129886498]
[{"$f":"INDEX(Lookup!$A$1:$A$126,MATCH(DataYY03!C44,Lookup!$C$1:$C$126,0))","v":"Administration"},"Electric","EXHIBITCENTERTELGEAG","Cypress, TX",33198,"1901-01-01",1062.5855120000001,1096.732808,3.21360451600057,18092.54,17970.349999999999,-0.67536122622915296,759,707,-6.8511198945981597]
[{"$f":"INDEX(Lookup!$A$1:$A$126,MATCH(DataYY03!C45,Lookup!$C$1:$C$126,0))","v":"Administration"},"Electric","FALCONCOMPLEX","Houston, TX",0,"1901-01-01",2674.4620799999998,2745.2133119999999,2.6454378444580602,48599.33,49138.06,1.1085132243592699,2402,2371,-1.29059117402165]
[{"$f":"INDEX(Lookup!$A$1:$A$126,MATCH(DataYY03!C46,Lookup!$C$1:$C$126,0))","v":"Elementary School"},"Electric","FARNEYES","Cypress, TX",95036,"1901-01-01",3657.1180800000002,3637.4649599999998,-0.53739364084194197,84291.17,85777.26,1.7630435074041599,6279,6153,-2.0066889632107001]
[{"$f":"INDEX(Lookup!$A$1:$A$126,MATCH(DataYY03!C47,Lookup!$C$1:$C$126,0))","v":"Elementary School"},"Electric","FIESTES","Houston, TX",91621,"1901-01-01",2728.8357120000001,2485.1370240000001,-8.9305005401512396,60086.95,54819.45,-8.7664626012803097,3855,3490,-9.4682230869001298]
[{"$f":"INDEX(Lookup!$A$1:$A$126,MATCH(DataYY03!C48,Lookup!$C$1:$C$126,0))","v":"Administration"},"Electric","FOODPRODUCTIONCENTER","Houston, TX",57684,"1901-01-01",13226.832956,12633.56122,-4.4853649998723197,243174.9,217540.12,-10.541704756535299,8311,7661,-7.8209601732643499]
[{"$f":"INDEX(Lookup!$A$1:$A$126,MATCH(DataYY03!C49,Lookup!$C$1:$C$126,0))","v":"Administration"},"Electric","FOODSERVICEWAREHOUSE","Houston, TX",48487,"2020-05-01",2563.7495039999999,2475.3104640000001,-3.4495975469528499,46707.839999999997,45085.11,-3.4742133226456202,2255,2208,-2.0842572062084299]
[{"$f":"INDEX(Lookup!$A$1:$A$126,MATCH(DataYY03!C50,Lookup!$C$1:$C$126,0))","v":"Elementary School"},"Electric","FRANCONEES","Houston, TX",90518,"1901-01-01",3164.01584,2963.6904960000002,-6.3313634991157199,72669.31,70080.820000000007,-3.5620126295405901,5170,4882,-5.5705996131528002]
[{"$f":"INDEX(Lookup!$A$1:$A$126,MATCH(DataYY03!C51,Lookup!$C$1:$C$126,0))","v":"Elementary School"},"Electric","FRAZIERES","Houston, TX",85844,"1901-01-01",3538.7148560000001,3469.7549239999998,-1.94872813453946,79938.490000000005,80659.899999999994,0.90245637614620899,5273,5039,-4.4377014981983702]
[{"$f":"INDEX(Lookup!$A$1:$A$126,MATCH(DataYY03!C52,Lookup!$C$1:$C$126,0))","v":"Elementary School"},"Electric","GLEASONES","Houston, TX",91424,"1901-01-01",3704.61312,3955.1904,6.7639257294429704,78116.039999999994,81889.66,4.8307876333720996,5092,4996,-1.8853102906520001]
[{"$f":"INDEX(Lookup!$A$1:$A$126,MATCH(DataYY03!C53,Lookup!$C$1:$C$126,0))","v":"Middle School"},"Electric","GOODSONMS","Cypress, TX",218801,"1901-01-01",6697.8856560000004,6166.2926440000001,-7.9367286827865602,138128.37,129052.11,-6.5708876460353496,9034,8162,-9.6524241753376092]
[{"$f":"INDEX(Lookup!$A$1:$A$126,MATCH(DataYY03!C54,Lookup!$C$1:$C$126,0))","v":"Elementary School"},"Electric","HAIRGROVEES","Houston, TX",85052,"1901-01-01",3156.291072,3186.4258559999998,0.95475300954753695,70345.919999999998,69334.509999999995,-1.43776639782378,4910,4478,-8.7983706720977608]
[{"$f":"INDEX(Lookup!$A$1:$A$126,MATCH(DataYY03!C55,Lookup!$C$1:$C$126,0))","v":"Elementary School"},"Electric","HAMILTONES","Cypress, TX",89692,"2020-08-01",2306.2936319999999,2278.7792639999998,-1.1930123561994099,54417.7,53457.9,-1.7637643634332201,3842,3620,-5.7782404997397201]
[{"$f":"INDEX(Lookup!$A$1:$A$126,MATCH(DataYY03!C56,Lookup!$C$1:$C$126,0))","v":"Middle School"},"Electric","HAMILTONMS","Cypress, TX",194726,"2020-08-01",8676.5419880000009,6819.0321279999998,-21.408412044441299,165118.34,133975,-18.861224016665901,8717,6293,-27.8077320178961]
[{"$f":"INDEX(Lookup!$A$1:$A$126,MATCH(DataYY03!C57,Lookup!$C$1:$C$126,0))","v":"Elementary School"},"Electric","HANCOCKES","Houston, TX",88795,"1901-01-01",3303.689472,2949.2236160000002,-10.7293938793047,77133.399999999994,71990.070000000007,-6.6680970889394198,5527,5029,-9.0103130088655696]
[{"$f":"INDEX(Lookup!$A$1:$A$126,MATCH(DataYY03!C58,Lookup!$C$1:$C$126,0))","v":"Elementary School"},"Electric","HEMMENWAYES","Katy, TX",101091,"2020-08-01",2868.7004160000001,2934.8659200000002,2.30646266270838,73350.210000000006,74460.98,1.5143378594280801,5804,5509,-5.0827015851137096]
[{"$f":"INDEX(Lookup!$A$1:$A$126,MATCH(DataYY03!C59,Lookup!$C$1:$C$126,0))","v":"Elementary School"},"Electric","HOLBROOKES","Houston, TX",99937,"1901-01-01",3578.8331520000002,3509.392128,-1.94032582829948,84514.37,79219.899999999994,-6.2645796211934099,5903,5070,-14.1114687447061]
[{"$f":"INDEX(Lookup!$A$1:$A$126,MATCH(DataYY03!C60,Lookup!$C$1:$C$126,0))","v":"Elementary School"},"Electric","HOLMSLEYES","Houston, TX",81704,"2020-08-01",2199.1841279999999,2119.2614400000002,-3.63419719988085,52042.35,50511.25,-2.9420270222232499,3537,5266,48.883234379417601]
[{"$f":"INDEX(Lookup!$A$1:$A$126,MATCH(DataYY03!C61,Lookup!$C$1:$C$126,0))","v":"Elementary School"},"Electric","HOOVERES","Katy, TX",112519,"1901-01-01",2694.93408,2849.7024000000001,5.7429352780310197,65620.17,65251.63,-0.56162609758554405,4905,4222,-13.9245667686035]
[{"$f":"INDEX(Lookup!$A$1:$A$126,MATCH(DataYY03!C62,Lookup!$C$1:$C$126,0))","v":"Middle School"},"Electric","HOPPERMS","Cypress, TX",226178,"1901-01-01",7629.6448520000004,7239.284756,-5.1163599823086496,169315.67,152027.76,-10.210460732902,9878,9319,-5.6590402915569902]
[{"$f":"INDEX(Lookup!$A$1:$A$126,MATCH(DataYY03!C63,Lookup!$C$1:$C$126,0))","v":"Elementary School"},"Electric","HORNEES","Houston, TX",87881,"1901-01-01",3235.5586560000002,3271.5893759999999,1.1135857461024501,71593.55,71570.350000000006,-3.24051538162307E-2,5001,4589,-8.2383523295340897]
[{"$f":"INDEX(Lookup!$A$1:$A$126,MATCH(DataYY03!C64,Lookup!$C$1:$C$126,0))","v":"Administration"},"Electric","ISCA","Houston, TX",132467,"1901-01-01",2130.5210400000001,2107.2512000000002,-1.09221357419684,44771.25,44709.46,-0.138012675545132,2831,2761,-2.4726245143058998]
[{"$f":"INDEX(Lookup!$A$1:$A$126,MATCH(DataYY03!C65,Lookup!$C$1:$C$126,0))","v":"Administration"},"Electric","ISCB","Houston, TX",0,"1901-01-01",2025.90912,2011.4422400000001,-0.71409323632442401,40349.96,40281.019999999997,-0.17085518796053301,2302,2295,-0.304083405734144]
[{"$f":"INDEX(Lookup!$A$1:$A$126,MATCH(DataYY03!C66,Lookup!$C$1:$C$126,0))","v":"Administration"},"Electric","ISCC","Houston, TX",0,"1901-01-01",3389.0713599999999,3464.40832,2.2229381443299001,63560.06,64376.67,1.2847848161250901,3368,3298,-2.0783847980997598]
[{"$f":"INDEX(Lookup!$A$1:$A$126,MATCH(DataYY03!C67,Lookup!$C$1:$C$126,0))","v":"Administration"},"Electric","ISCC-EXLIGHT","Houston, TX",0,"1901-01-01",24.975840000000002,24.975840000000002,0,1130.3699999999999,960.79,-15.0021674319028,0,0,0]
[{"$f":"INDEX(Lookup!$A$1:$A$126,MATCH(DataYY03!C68,Lookup!$C$1:$C$126,0))","v":"Administration"},"Electric","ISCD","Houston, TX",0,"1901-01-01",93.761759999999995,86.937759999999997,-7.2780203784570503,2824.22,2712.26,-3.96428040308475,224,209,-6.6964285714285703]
[{"$f":"INDEX(Lookup!$A$1:$A$126,MATCH(DataYY03!C69,Lookup!$C$1:$C$126,0))","v":"Administration"},"Electric","ISCDATACENTER","Houston, TX",0,"1901-01-01",757.893912,889.81206799999995,17.405886748962299,12612.88,13672,8.3971305522608599,410,415,1.2195121951219501]
[{"$f":"INDEX(Lookup!$A$1:$A$126,MATCH(DataYY03!C70,Lookup!$C$1:$C$126,0))","v":"Administration"},"Electric","ISCSW","Houston, TX",0,"1901-01-01",274.76153599999998,249.21248,-9.2986290482813505,5509.41,5061.6400000000003,-8.1273675402629308,301,282,-6.3122923588039903]
[{"$f":"INDEX(Lookup!$A$1:$A$126,MATCH(DataYY03!C71,Lookup!$C$1:$C$126,0))","v":"Administration"},"Electric","ISCW","Houston, TX",35364,"1901-01-01",1984.3100159999999,2085.1960319999998,5.0841862000660401,42989.23,44934.02,4.5239005211305203,2875,2850,-0.86956521739130399]
[{"$f":"INDEX(Lookup!$A$1:$A$126,MATCH(DataYY03!C72,Lookup!$C$1:$C$126,0))","v":"Administration"},"Electric","JARVISCENTRALPLANT","Cypress, TX",12152,"1901-01-01",9624.5593640000006,10312.46292,7.1473771419921404,245349.63,259299.6,5.6857513907805801,23703,21156,-10.7454752562967]
[{"$f":"INDEX(Lookup!$A$1:$A$126,MATCH(DataYY03!C73,Lookup!$C$1:$C$126,0))","v":"High School"},"Electric","JERSEYVILLAGEHS","Houston, TX",513473,"2020-05-01",16243.679,15992.467087999999,-1.5465210313501001,340694.22,331252.59000000003,-2.7712915117843799,20352,19858,-2.4272798742138399]
[{"$f":"INDEX(Lookup!$A$1:$A$126,MATCH(DataYY03!C74,Lookup!$C$1:$C$126,0))","v":"Administration"},"Electric","JERSEYVILLAGESTADIUM","Houston, TX",2385,"1901-01-01",186.04953599999999,192.31396799999999,3.36707746478876,11230.31,7915.62,-29.5155699174822,1182,2055,73.857868020304593]
[{"$f":"INDEX(Lookup!$A$1:$A$126,MATCH(DataYY03!C75,Lookup!$C$1:$C$126,0))","v":"Elementary School"},"Electric","JOWELLES","Katy, TX",73726,"1901-01-01",2009.203968,1875.562752,-6.6514509292468098,51231.24,48531.22,-5.2702608798850097,3793,3447,-9.1220669654626896]
[{"$f":"INDEX(Lookup!$A$1:$A$126,MATCH(DataYY03!C76,Lookup!$C$1:$C$126,0))","v":"Middle School"},"Electric","KAHLAMS","Houston, TX",221601,"1901-01-01",7539.6397040000002,7317.1397720000004,-2.95106849577913,170681.03,173693.53,1.7649881770692399,11155,10495,-5.9166293142088797]
[{"$f":"INDEX(Lookup!$A$1:$A$126,MATCH(DataYY03!C77,Lookup!$C$1:$C$126,0))","v":"Elementary School"},"Electric","KEITHES","Cypress, TX",95518,"1901-01-01",2934.2108159999998,2811.0512640000002,-4.1973654833668297,68392.69,65263.519999999997,-4.5752989098688799,4972,4383,-11.846339501206799]
[{"$f":"INDEX(Lookup!$A$1:$A$126,MATCH(DataYY03!C78,Lookup!$C$1:$C$126,0))","v":"Elementary School"},"Electric","KIRKES","Houston, TX",93897,"1901-01-01",3716.4049920000002,3542.4748800000002,-4.6800634584875702,84146.87,80123.81,-4.7809977958776102,6082,5400,-11.2134166392634]
[{"$f":"INDEX(Lookup!$A$1:$A$126,MATCH(DataYY03!C79,Lookup!$C$1:$C$126,0))","v":"Middle School"},"Electric","LABAYMS","Houston, TX",190510,"2020-05-01",6602.4861360000004,5312.1530359999997,-19.543139863095998,135704.60999999999,114643.31,-15.519959122980399,7080,7367,4.0536723163841799]
[{"$f":"INDEX(Lookup!$A$1:$A$126,MATCH(DataYY03!C80,Lookup!$C$1:$C$126,0))","v":"Elementary School"},"Electric","LAMKINES","Cypress, TX",113622,"2020-05-05",3060.9734400000002,2793.1996800000002,-8.7479935794542492,69140.87,63898.42,-7.5822736971634903,4585,4240,-7.5245365321701199]
[{"$f":"INDEX(Lookup!$A$1:$A$126,MATCH(DataYY03!C81,Lookup!$C$1:$C$126,0))","v":"High School"},"Electric","LANGHAMCREEKHS","Houston, TX",535686,"1901-01-01",14829.039916,11719.981159999999,-20.9660151541263,296292.12,238023.91,-19.665798064423701,16526,15035,-9.0221469200048396]
[{"$f":"INDEX(Lookup!$A$1:$A$126,MATCH(DataYY03!C82,Lookup!$C$1:$C$126,0))","v":"Administration"},"Electric","LANGHAMCREEKRETENTIONPOND","Houston, TX",0,"1901-01-01",14.412288,11.791872,-18.181818181818201,2726.6,3779.21,38.605222621579998,250,483,93.2]
[{"$f":"INDEX(Lookup!$A$1:$A$126,MATCH(DataYY03!C83,Lookup!$C$1:$C$126,0))","v":"Elementary School"},"Electric","LEEES","Houston, TX",95352,"1901-01-01",4105.5367679999999,3371.165184,-17.8873464177437,83973.89,75279.41,-10.3537897315463,5104,5002,-1.99843260188088]
[{"$f":"INDEX(Lookup!$A$1:$A$126,MATCH(DataYY03!C84,Lookup!$C$1:$C$126,0))","v":"Elementary School"},"Electric","LIEDERES","Houston, TX",88406,"1901-01-01",2895.887232,2651.205888,-8.4492704445198594,67008.850000000006,64786.559999999998,-3.3164126828023499,4772,4587,-3.8767812238055299]
[{"$f":"INDEX(Lookup!$A$1:$A$126,MATCH(DataYY03!C85,Lookup!$C$1:$C$126,0))","v":"Elementary School"},"Electric","LOWERYES","Houston, TX",78614,"2020-05-05",3037.7172479999999,3079.643904,1.38020271727412,74402.53,71942.820000000007,-3.3059494079032001,5692,4871,-14.4237526352776]
[{"$f":"INDEX(Lookup!$A$1:$A$126,MATCH(DataYY03!C86,Lookup!$C$1:$C$126,0))","v":"Administration"},"Electric","MAINTENANCEOPER","Houston, TX",36679,"2020-05-01",3371.8202879999999,2801.2247040000002,-16.922479114047,65379.519999999997,54713.9,-16.313395999236501,3727,3096,-16.930507110276402]
[{"$f":"INDEX(Lookup!$A$1:$A$126,MATCH(DataYY03!C87,Lookup!$C$1:$C$126,0))","v":"Elementary School"},"Electric","MATZKEMILLSES","Houston, TX",124682,"1901-01-01",3232.283136,3133.3624319999999,-3.0603972436157201,69790.75,67645,-3.0745478448075101,4347,4179,-3.8647342995169098]
[{"$f":"INDEX(Lookup!$A$1:$A$126,MATCH(DataYY03!C88,Lookup!$C$1:$C$126,0))","v":"Elementary School"},"Electric","MCFEEES","Katy, TX",105539,"1901-01-01",3507.1436199999998,3191.7997559999999,-8.9914727814881896,84372.82,72596.41,-13.957587289366399,4609,4106,-10.913430245172499]
[{"$f":"INDEX(Lookup!$A$1:$A$126,MATCH(DataYY03!C89,Lookup!$C$1:$C$126,0))","v":"Elementary School"},"Electric","METCALFES","Houston, TX",85120,"2020-05-05",2424.212352,2310.224256,-4.7020672882042902,58856.69,58764.67,-0.15634586314656801,4497,4383,-2.5350233488992702]
[{"$f":"INDEX(Lookup!$A$1:$A$126,MATCH(DataYY03!C90,Lookup!$C$1:$C$126,0))","v":"Elementary School"},"Electric","MILLSAPES","Cypress, TX",77324,"1901-01-01",2657.7569279999998,2442.8828159999998,-8.0847917180182396,63850.81,59060.78,-7.5019095294170901,4685,4147,-11.483457844183601]
[{"$f":"INDEX(Lookup!$A$1:$A$126,MATCH(DataYY03!C91,Lookup!$C$1:$C$126,0))","v":"Administration"},"Electric","MILLSAPNATURETRAIL","Cypress, TX",1121,"1901-01-01",7.2880320000000003,12.798412000000001,75.608614232209803,216.41,303.14,40.076706252021602,22,23,4.5454545454545503]
[{"$f":"INDEX(Lookup!$A$1:$A$126,MATCH(DataYY03!C92,Lookup!$C$1:$C$126,0))","v":"Administration"},"Electric","MILLSAPROPES","Cypress, TX",924,"1901-01-01",15.674728,16.36054,4.3752720940356902,407.29,371.59,-8.7652532593483805,21,18,-14.285714285714301]
[{"$f":"INDEX(Lookup!$A$1:$A$126,MATCH(DataYY03!C93,Lookup!$C$1:$C$126,0))","v":"Elementary School"},"Electric","MOOREES","Houston, TX",83063,"2020-05-01",2197.2188160000001,2036.7183359999999,-7.3047107930828901,51165.86,47735.25,-6.7048809499146502,3420,3205,-6.2865497076023402]
[{"$f":"INDEX(Lookup!$A$1:$A$126,MATCH(DataYY03!C94,Lookup!$C$1:$C$126,0))","v":"Elementary School"},"Electric","OWENSES","Houston, TX",85590,"2020-05-01",2974.1721600000001,3089.470464,3.8766519823788301,72177.929999999993,75023.11,3.9418974747544002,5590,5416,-3.1127012522361399]
[{"$f":"INDEX(Lookup!$A$1:$A$126,MATCH(DataYY03!C95,Lookup!$C$1:$C$126,0))","v":"Elementary School"},"Electric","POPEES","Cypress, TX",112970,"1901-01-01",3029.2008959999998,2830.0492800000002,-6.5743944636678,63940.15,61849.68,-3.26941679054553,4154,4019,-3.2498796340876299]
[{"$f":"INDEX(Lookup!$A$1:$A$126,MATCH(DataYY03!C96,Lookup!$C$1:$C$126,0))","v":"Elementary School"},"Electric","POSTES","Houston, TX",104852,"1901-01-01",3227.697408,3865.7687040000001,19.768621879439799,75541.31,85411.64,13.066135601831601,5356,5419,1.17625093353249]
[{"$f":"INDEX(Lookup!$A$1:$A$126,MATCH(DataYY03!C97,Lookup!$C$1:$C$126,0))","v":"Elementary School"},"Electric","POSTMAES","Cypress, TX",98920,"1901-01-01",3181.8401279999998,3018.7192319999999,-5.1266213712167996,71784.53,68757.929999999993,-4.2162287612665299,4887,4607,-5.7294863924698198]
[{"$f":"INDEX(Lookup!$A$1:$A$126,MATCH(DataYY03!C98,Lookup!$C$1:$C$126,0))","v":"Administration"},"Electric","PRIDGEONSTADIUM","Houston, TX",86181,"1901-01-01",2278.7792639999998,2303.3456639999999,1.07805088400171,50324.5,48466.2,-3.6926348001470499,3246,2853,-12.107208872458401]
[{"$f":"INDEX(Lookup!$A$1:$A$126,MATCH(DataYY03!C99,Lookup!$C$1:$C$126,0))","v":"Administration"},"Electric","RECYCLECENTER","Houston, TX",0,"1901-01-01",53.390976000000002,35.730463999999998,-33.077709611451901,1829.72,1621.2,-11.3962792121199,150,149,-0.66666666666666696]
[{"$f":"INDEX(Lookup!$A$1:$A$126,MATCH(DataYY03!C100,Lookup!$C$1:$C$126,0))","v":"Elementary School"},"Electric","REEDES","Houston, TX",90012,"1901-01-01",2714.7509759999998,2898.180096,6.7567567567567401,65321.120000000003,67861.929999999993,3.88972203783401,4768,4651,-2.4538590604026802]
[{"$f":"INDEX(Lookup!$A$1:$A$126,MATCH(DataYY03!C101,Lookup!$C$1:$C$126,0))","v":"Elementary School"},"Electric","RENNELLES","Cypress, TX",113621,"2019-08-01",1956.7819999999999,1933.42686,-1.19354838709676,38170.339999999997,37464.39,-1.84947265337432,2129,1968,-7.56223579145139]
[{"$f":"INDEX(Lookup!$A$1:$A$126,MATCH(DataYY03!C102,Lookup!$C$1:$C$126,0))","v":"Elementary School"},"Electric","ROBINSONES","Katy, TX",98532,"2020-05-05",2919.1434239999999,2834.6350080000002,-2.8949730700179299,69904.39,67462.320000000007,-3.4934429726087299,5171,4646,-10.1527750918584]
[{"$f":"INDEX(Lookup!$A$1:$A$126,MATCH(DataYY03!C103,Lookup!$C$1:$C$126,0))","v":"Elementary School"},"Electric","ROBISONES","Cypress, TX",93882,"2020-05-01",2505.7728000000002,2235.5423999999998,-10.7843137254902,48486.22,43964.59,-9.3255980771443898,2730,2508,-8.1318681318681296]
[{"$f":"INDEX(Lookup!$A$1:$A$126,MATCH(DataYY03!C104,Lookup!$C$1:$C$126,0))","v":"Middle School"},"Electric","SALYARDSMS","Cypress, TX",242116,"2020-05-01",7132.1206599999996,6283.7882760000002,-11.8945321376546,149181.04999999999,134140.17000000001,-10.0822993268917,9901,8653,-12.6047873952126]
[{"$f":"INDEX(Lookup!$A$1:$A$126,MATCH(DataYY03!C105,Lookup!$C$1:$C$126,0))","v":"Elementary School"},"Electric","SAMPSONES","Cypress, TX",96096,"1901-01-01",3374.850144,3080.6265600000002,-8.7181229223788694,78435.48,74547.47,-4.9569531543633101,5772,5204,-9.8406098406098401]
[{"$f":"INDEX(Lookup!$A$1:$A$126,MATCH(DataYY03!C106,Lookup!$C$1:$C$126,0))","v":"Administration"},"Electric","SATELLITECOLDFOODWAREHOUSE","Cypress, TX",22020,"1901-01-01",5274.91788,5314.2036479999997,0.74476549007432902,89165.45,87117.759999999995,-2.2965061018589599,3626,3566,-1.6547159404302301]
[{"$f":"INDEX(Lookup!$A$1:$A$126,MATCH(DataYY03!C107,Lookup!$C$1:$C$126,0))","v":"Elementary School"},"Electric","SHERIDANES","Katy, TX",92874,"2020-08-01",3551.973888,3259.7975040000001,-8.2257469568425101,79963.899999999994,77619.100000000006,-2.9323232108488999,5664,5502,-2.8601694915254199]
[{"$f":"INDEX(Lookup!$A$1:$A$126,MATCH(DataYY03!C108,Lookup!$C$1:$C$126,0))","v":"Middle School"},"Electric","SMITHMS","Cypress, TX",233159,"2020-08-01",4991.8924800000004,4169.7369600000002,-16.4698162729659,97629.57,83116.460000000006,-14.8654859383279,5424,4627,-14.693952802359901]
[{"$f":"INDEX(Lookup!$A$1:$A$126,MATCH(DataYY03!C109,Lookup!$C$1:$C$126,0))","v":"Middle School"},"Electric","SPILLANEMS","Cypress, TX",235889,"1901-01-01",6808.5334039999998,6212.9278599999998,-8.7479271769465399,128770.89,114024.16,-11.4519127731431,6054,5502,-9.1179385530227908]
[{"$f":"INDEX(Lookup!$A$1:$A$126,MATCH(DataYY03!C110,Lookup!$C$1:$C$126,0))","v":"Elementary School"},"Electric","SWENKEES","Cypress, TX",107914,"1901-01-01",3399.9897599999999,3060.9734400000002,-9.9710982658959502,76214.86,74056.81,-2.8315344278005599,5343,5278,-1.21654501216545]
[{"$f":"INDEX(Lookup!$A$1:$A$126,MATCH(DataYY03!C111,Lookup!$C$1:$C$126,0))","v":"Administration"},"Electric","TELGETRANS","Cypress, TX",19649,"1901-01-01",1142.3376000000001,1164.58384,1.94743130227002,21976.6,22431.3,2.0690188655205999,1186,1221,2.9510961214165299]
[{"$f":"INDEX(Lookup!$A$1:$A$126,MATCH(DataYY03!C112,Lookup!$C$1:$C$126,0))","v":"Middle School"},"Electric","THORNTONMS","Katy, TX",202739,"2020-08-01",6809.4409960000003,6072.1760359999998,-10.8270996170329,137991.70000000001,125688.36,-8.9160000202910794,8146,8277,1.6081512398723301]
[{"$f":"INDEX(Lookup!$A$1:$A$126,MATCH(DataYY03!C113,Lookup!$C$1:$C$126,0))","v":"Elementary School"},"Electric","TIPPSES","Houston, TX",101727,"1901-01-01",3730.5647920000001,3668.555104,-1.6622064340760601,84275.34,78960.539999999994,-6.3064711456518596,4835,4528,-6.3495346432264697]
[{"$f":"INDEX(Lookup!$A$1:$A$126,MATCH(DataYY03!C114,Lookup!$C$1:$C$126,0))","v":"Middle School"},"Electric","TRUITTMS","Houston, TX",209274,"2020-05-01",5712.8822,4779.9356280000002,-16.330576044435102,118766.51,99526.89,-16.1995330165044,7002,6568,-6.1982290774064603]
[{"$f":"INDEX(Lookup!$A$1:$A$126,MATCH(DataYY03!C115,Lookup!$C$1:$C$126,0))","v":"Elementary School"},"Electric","WALKERES","Katy, TX",98321,"1901-01-01",3988.8190719999998,3206.5054759999998,-19.612661839980301,85520.81,80235.740000000005,-6.17986429267917,4526,4482,-0.97216084843128603]
[{"$f":"INDEX(Lookup!$A$1:$A$126,MATCH(DataYY03!C116,Lookup!$C$1:$C$126,0))","v":"Elementary School"},"Electric","WARNERES","Cypress, TX",98451,"2020-08-01",2247.985964,2424.4307199999998,7.8490150216969701,45703.23,45416.18,-0.62807377071598702,2671,2548,-4.6050168476226103]
[{"$f":"INDEX(Lookup!$A$1:$A$126,MATCH(DataYY03!C117,Lookup!$C$1:$C$126,0))","v":"Middle School"},"Electric","WATKINSMS","Houston, TX",220237,"2020-08-01",6411.9532319999998,6466.4428719999996,0.84981343482140903,133568.54,131063.79,-1.8752544573744701,8020,7323,-8.6907730673316692]
[{"$f":"INDEX(Lookup!$A$1:$A$126,MATCH(DataYY03!C118,Lookup!$C$1:$C$126,0))","v":"Elementary School"},"Electric","WELLSES","Cypress, TX",122878,"1901-01-01",3442.57152,3442.57152,-1.69081921974035E-14,78349.03,79044.39,0.88751577396682502,5262,5222,-0.76016723679209397]
[{"$f":"INDEX(Lookup!$A$1:$A$126,MATCH(DataYY03!C119,Lookup!$C$1:$C$126,0))","v":"Administration"},"Electric","WESTGREENAGSCIENCECENTER","Cypress, TX",20124,"1901-01-01",349.825536,324.27647999999999,-7.30337078651685,7033.83,5816.55,-17.306076490333101,390,264,-32.307692307692299]
[{"$f":"INDEX(Lookup!$A$1:$A$126,MATCH(DataYY03!C120,Lookup!$C$1:$C$126,0))","v":"Administration"},"Electric","WESTGREENTRANS","Cypress, TX",45340,"1901-01-01",1842.152448,1748.4725759999999,-5.0853485064011199,34122.65,32276.76,-5.4095739926412501,1744,1594,-8.6009174311926593]
[{"$f":"INDEX(Lookup!$A$1:$A$126,MATCH(DataYY03!C121,Lookup!$C$1:$C$126,0))","v":"Elementary School"},"Electric","WILLBERNES","Houston, TX",89993,"1901-01-01",2733.7489919999998,2565.7148160000002,-6.1466570812365102,60113.63,59349.81,-1.2706269776089101,3934,3949,0.38129130655821097]
[{"$f":"INDEX(Lookup!$A$1:$A$126,MATCH(DataYY03!C122,Lookup!$C$1:$C$126,0))","v":"Elementary School"},"Electric","WILSONES","Houston, TX",84992,"1901-01-01",2950.5884160000001,2862.8044799999998,-2.97513321492006,69315.83,65454.75,-5.5702716103954897,5259,4464,-15.1169423844837]
[{"$f":"INDEX(Lookup!$A$1:$A$126,MATCH(DataYY03!C123,Lookup!$C$1:$C$126,0))","v":"Special School"},"Electric","WINDFERNANNEX","Houston, TX",59400,"2020-05-01",2469.74208,2339.7585279999998,-5.2630415561450103,50413.11,47674.97,-5.4314046485130598,3071,2975,-3.1260175838489102]
[{"$f":"INDEX(Lookup!$A$1:$A$126,MATCH(DataYY03!C124,Lookup!$C$1:$C$126,0))","v":"Special School"},"Electric","WINDFERNHS","Houston, TX",50022,"1901-01-01",1943.0043439999999,2210.3208960000002,13.757897805296899,47721.41,50345.18,5.4980982330572399,3756,3360,-10.5431309904153]
[{"$f":"INDEX(Lookup!$A$1:$A$126,MATCH(DataYY03!C125,Lookup!$C$1:$C$126,0))","v":"Elementary School"},"Electric","WOODARDES","Cypress, TX",116974,"2020-08-01",3323.83392,3215.7417599999999,-3.2520325203252201,78771.31,75687.649999999994,-3.9146994000734501,5688,5135,-9.7222222222222197]
[{"$f":"INDEX(Lookup!$A$1:$A$126,MATCH(DataYY03!C126,Lookup!$C$1:$C$126,0))","v":"Elementary School"},"Electric","YEAGERES","Houston, TX",81794,"1901-01-01",3193.6320000000001,2721.95712,-14.7692307692308,75335.259999999995,63459.71,-15.7636012671888,5496,4371,-20.469432314410501]
[{"$f":"INDEX(Lookup!$A$1:$A$126,MATCH(DataYY03!C127,Lookup!$C$1:$C$126,0))","v":"Elementary School"},"Water","ADAM-ES","Houston, TX",103177,"1901-01-01",0,0,0,12293.76,12156.03,-1.1203244572856501,0,0,0]
[{"$f":"INDEX(Lookup!$A$1:$A$126,MATCH(DataYY03!C128,Lookup!$C$1:$C$126,0))","v":"Special School"},"Water","ALCWEST","Katy, TX",50839,"1901-01-01",0,0,0,4941.8,3759.35,-23.927516289611098,0,0,0]
[{"$f":"INDEX(Lookup!$A$1:$A$126,MATCH(DataYY03!C129,Lookup!$C$1:$C$126,0))","v":"Elementary School"},"Water","ANDREES","Cypress, TX",106300,"2020-05-01",0,0,0,33521.58,31871.45,-4.9225901643060999,0,0,0]
[{"$f":"INDEX(Lookup!$A$1:$A$126,MATCH(DataYY03!C130,Lookup!$C$1:$C$126,0))","v":"Middle School"},"Water","ANTHONYMS","Cypress, TX",244123,"1901-01-01",0,0,0,54586.73,38873.64,-28.7855491618567,0,0,0]
[{"$f":"INDEX(Lookup!$A$1:$A$126,MATCH(DataYY03!C131,Lookup!$C$1:$C$126,0))","v":"Middle School"},"Water","ARAGONMS","Houston, TX",219821,"1901-01-01",0,0,0,28444.25,25701.83,-9.6413862204136205,0,0,0]
[{"$f":"INDEX(Lookup!$A$1:$A$126,MATCH(DataYY03!C132,Lookup!$C$1:$C$126,0))","v":"Elementary School"},"Water","AULTES","Cypress, TX",91912,"2020-05-01",0,0,0,14095.35,15002.6,6.4365198451971803,0,0,0]
[{"$f":"INDEX(Lookup!$A$1:$A$126,MATCH(DataYY03!C133,Lookup!$C$1:$C$126,0))","v":"Elementary School"},"Water","BANEES","Houston, TX",106804,"1901-01-01",0,0,0,16659.47,12635.4,-24.154850064257701,0,0,0]
[{"$f":"INDEX(Lookup!$A$1:$A$126,MATCH(DataYY03!C134,Lookup!$C$1:$C$126,0))","v":"Elementary School"},"Water","BANGES","Houston, TX",89313,"2020-08-01",0,0,0,19080.8,13085.17,-31.422319818875501,0,0,0]
[{"$f":"INDEX(Lookup!$A$1:$A$126,MATCH(DataYY03!C135,Lookup!$C$1:$C$126,0))","v":"Administration"},"Water","BARKERTRANS","Houston, TX",22677,"1901-01-01",0,0,0,7832.16,3815.7,-51.281638781638797,0,0,0]
[{"$f":"INDEX(Lookup!$A$1:$A$126,MATCH(DataYY03!C136,Lookup!$C$1:$C$126,0))","v":"Administration"},"Water","BERRYCENTER","Cypress, TX",491434,"1901-01-01",0,0,0,72348.17,50036.97,-30.8386514821315,0,0,0]
[{"$f":"INDEX(Lookup!$A$1:$A$126,MATCH(DataYY03!C137,Lookup!$C$1:$C$126,0))","v":"Elementary School"},"Water","BIRKESES","Houston, TX",104952,"2020-08-01",0,0,0,17257.55,16496.689999999999,-4.4088529368305496,0,0,0]
[{"$f":"INDEX(Lookup!$A$1:$A$126,MATCH(DataYY03!C138,Lookup!$C$1:$C$126,0))","v":"Elementary School"},"Water","BLACKES","Cypress, TX",99456,"2020-08-01",0,0,0,31185.279999999999,29171.96,-6.45599462310423,0,0,0]
[{"$f":"INDEX(Lookup!$A$1:$A$126,MATCH(DataYY03!C139,Lookup!$C$1:$C$126,0))","v":"Middle School"},"Water","BLEYLMS","Houston, TX",229363,"1901-01-01",0,0,0,21496.48,21991.99,2.3050750634522501,0,0,0]
[{"$f":"INDEX(Lookup!$A$1:$A$126,MATCH(DataYY03!C140,Lookup!$C$1:$C$126,0))","v":"Administration"},"Water","BRADLEYPOLICESTATION","Cypress, TX",19680,"2020-05-01",0,0,0,1444.1,849.6,-41.167509175264897,0,0,0]
[{"$f":"INDEX(Lookup!$A$1:$A$126,MATCH(DataYY03!C141,Lookup!$C$1:$C$126,0))","v":"Special School"},"Water","BRAUTIGAMCENTER","Houston, TX",85895,"2020-05-01",0,0,0,24555.13,29989.89,22.132890357330599,0,0,0]
[{"$f":"INDEX(Lookup!$A$1:$A$126,MATCH(DataYY03!C142,Lookup!$C$1:$C$126,0))","v":"High School"},"Water","BRIDGELANDHS","Cypress, TX",573468,"1901-01-01",0,0,0,86777.75,81317.16,-6.29261533054268,0,0,0]
[{"$f":"INDEX(Lookup!$A$1:$A$126,MATCH(DataYY03!C143,Lookup!$C$1:$C$126,0))","v":"Middle School"},"Water","COOKMS","Houston, TX",205797,"2020-05-01",0,0,0,48491.56,34157.42,-29.5600718970476,0,0,0]
[{"$f":"INDEX(Lookup!$A$1:$A$126,MATCH(DataYY03!C144,Lookup!$C$1:$C$126,0))","v":"Elementary School"},"Water","COPELANDES","Houston, TX",86318,"1901-01-01",0,0,0,24347.16,17714.34,-27.2426845677278,0,0,0]
[{"$f":"INDEX(Lookup!$A$1:$A$126,MATCH(DataYY03!C145,Lookup!$C$1:$C$126,0))","v":"High School"},"Water","CY-CREEKHS","Houston, TX",527749,"2020-05-01",0,0,0,112751.73,124312.97,10.2537140671811,0,0,0]
["Administration","Water","CY-FAIRCOMPLEX","Cypress, TX",0,"1901-01-01",0,0,0,181245.2,140583.20000000001,-22.434801031972199,0,0,0]
[{"$f":"INDEX(Lookup!$A$1:$A$126,MATCH(DataYY03!C147,Lookup!$C$1:$C$126,0))","v":"High School"},"Water","CY-FALLSHS","Houston, TX",567967,"2020-05-01",0,0,0,79632.25,71405.399999999994,-10.331053059533,0,0,0]
[{"$f":"INDEX(Lookup!$A$1:$A$126,MATCH(DataYY03!C148,Lookup!$C$1:$C$126,0))","v":"High School"},"Water","CY-LAKESHS","Katy, TX",514068,"2020-05-01",0,0,0,87024.16,81016.38,-6.9035771215717601,0,0,0]
[{"$f":"INDEX(Lookup!$A$1:$A$126,MATCH(DataYY03!C149,Lookup!$C$1:$C$126,0))","v":"High School"},"Water","CY-PARKHS","Cypress, TX",590057,"1901-01-01",0,0,0,71026.94,70026.080000000002,-1.4091272973325299,0,0,0]
[{"$f":"INDEX(Lookup!$A$1:$A$126,MATCH(DataYY03!C150,Lookup!$C$1:$C$126,0))","v":"High School"},"Water","CY-RANCHHS","Cypress, TX",527131,"2020-05-01",0,0,0,105142.58,87761.39,-16.5310666715616,0,0,0]
[{"$f":"INDEX(Lookup!$A$1:$A$126,MATCH(DataYY03!C151,Lookup!$C$1:$C$126,0))","v":"High School"},"Water","CY-RIDGEHS","Houston, TX",502564,"2020-08-01",0,0,0,70131.789999999994,52972.09,-24.467791282669399,0,0,0]
[{"$f":"INDEX(Lookup!$A$1:$A$126,MATCH(DataYY03!C152,Lookup!$C$1:$C$126,0))","v":"High School"},"Water","CY-SPRINGSHS","Cypress, TX",478615,"2020-08-01",0,0,0,218019.94,204419.58,-6.2381266594238998,0,0,0]
[{"$f":"INDEX(Lookup!$A$1:$A$126,MATCH(DataYY03!C153,Lookup!$C$1:$C$126,0))","v":"High School"},"Water","CY-WOODSHS","Cypress, TX",535914,"1901-01-01",0,0,0,54711.02,36924.160000000003,-32.510561857556297,0,0,0]
[{"$f":"INDEX(Lookup!$A$1:$A$126,MATCH(DataYY03!C154,Lookup!$C$1:$C$126,0))","v":"Elementary School"},"Water","DANISHES","Houston, TX",98052,"2020-05-01",0,0,0,18637.25,18981.43,1.84673167983474,0,0,0]
[{"$f":"INDEX(Lookup!$A$1:$A$126,MATCH(DataYY03!C155,Lookup!$C$1:$C$126,0))","v":"Middle School"},"Water","DEANMS","Houston, TX",222788,"2020-08-01",0,0,0,37049.67,53712.31,44.973787890688399,0,0,0]
[{"$f":"INDEX(Lookup!$A$1:$A$126,MATCH(DataYY03!C156,Lookup!$C$1:$C$126,0))","v":"Elementary School"},"Water","DURYEAES","Katy, TX",96423,"2020-05-01",0,0,0,22781.08,18248.62,-19.895720483840101,0,0,0]
[{"$f":"INDEX(Lookup!$A$1:$A$126,MATCH(DataYY03!C157,Lookup!$C$1:$C$126,0))","v":"Administration"},"Water","ELC1","Houston, TX",6832,"1901-01-01",0,0,0,1888.81,1456.96,-22.863601950434401,0,0,0]
[{"$f":"INDEX(Lookup!$A$1:$A$126,MATCH(DataYY03!C158,Lookup!$C$1:$C$126,0))","v":"Administration"},"Water","ELC2","Houston, TX",4573,"1901-01-01",0,0,0,2472.25,1665.97,-32.613206593184302,0,0,0]
[{"$f":"INDEX(Lookup!$A$1:$A$126,MATCH(DataYY03!C159,Lookup!$C$1:$C$126,0))","v":"Administration"},"Water","ELDRIDGETRANS","Houston, TX",26451,"1901-01-01",0,0,0,9933.2000000000007,8933.2999999999993,-10.0662424998993,0,0,0]
[{"$f":"INDEX(Lookup!$A$1:$A$126,MATCH(DataYY03!C160,Lookup!$C$1:$C$126,0))","v":"Elementary School"},"Water","EMERYES","Katy, TX",98438,"2020-08-01",0,0,0,47098.9,14676.48,-68.839017471745606,0,0,0]
[{"$f":"INDEX(Lookup!$A$1:$A$126,MATCH(DataYY03!C161,Lookup!$C$1:$C$126,0))","v":"Elementary School"},"Water","EMMOTTES","Houston, TX",77394,"2020-05-01",0,0,0,18302.25,13522.85,-26.113729186302201,0,0,0]
[{"$f":"INDEX(Lookup!$A$1:$A$126,MATCH(DataYY03!C162,Lookup!$C$1:$C$126,0))","v":"Administration"},"Water","FALCONCOMPLEX","Houston, TX",0,"1901-01-01",0,0,0,199401.77,88930.83,-55.401183249276102,0,0,0]
[{"$f":"INDEX(Lookup!$A$1:$A$126,MATCH(DataYY03!C163,Lookup!$C$1:$C$126,0))","v":"Elementary School"},"Water","FARNEYES","Cypress, TX",95036,"1901-01-01",0,0,0,20037.52,16463.439999999999,-17.836937904491201,0,0,0]
[{"$f":"INDEX(Lookup!$A$1:$A$126,MATCH(DataYY03!C164,Lookup!$C$1:$C$126,0))","v":"Elementary School"},"Water","FIESTES","Houston, TX",91621,"1901-01-01",0,0,0,24230.7,21105.94,-12.8958717659828,0,0,0]
[{"$f":"INDEX(Lookup!$A$1:$A$126,MATCH(DataYY03!C165,Lookup!$C$1:$C$126,0))","v":"Elementary School"},"Water","FRANCONEES","Houston, TX",90518,"1901-01-01",0,0,0,9625.7900000000009,6190.87,-35.684551605634397,0,0,0]
[{"$f":"INDEX(Lookup!$A$1:$A$126,MATCH(DataYY03!C166,Lookup!$C$1:$C$126,0))","v":"Elementary School"},"Water","FRAZIERES","Houston, TX",85844,"1901-01-01",0,0,0,3804.65,3084.95,-18.916326074671801,0,0,0]
[{"$f":"INDEX(Lookup!$A$1:$A$126,MATCH(DataYY03!C167,Lookup!$C$1:$C$126,0))","v":"Elementary School"},"Water","GLEASONES","Houston, TX",91424,"1901-01-01",0,0,0,13570,15919.51,17.314001473839401,0,0,0]
[{"$f":"INDEX(Lookup!$A$1:$A$126,MATCH(DataYY03!C168,Lookup!$C$1:$C$126,0))","v":"Middle School"},"Water","GOODSONMS","Cypress, TX",218801,"1901-01-01",0,0,0,45357.36,30231.48,-33.348237198990397,0,0,0]
[{"$f":"INDEX(Lookup!$A$1:$A$126,MATCH(DataYY03!C169,Lookup!$C$1:$C$126,0))","v":"Elementary School"},"Water","HAIRGROVEES","Houston, TX",85052,"1901-01-01",0,0,0,20290.04,16249.13,-19.9157320537564,0,0,0]
[{"$f":"INDEX(Lookup!$A$1:$A$126,MATCH(DataYY03!C170,Lookup!$C$1:$C$126,0))","v":"Elementary School"},"Water","HAMILTONES","Cypress, TX",89692,"2020-08-01",0,0,0,26388.06,15057.02,-42.9400266635744,0,0,0]
[{"$f":"INDEX(Lookup!$A$1:$A$126,MATCH(DataYY03!C171,Lookup!$C$1:$C$126,0))","v":"Middle School"},"Water","HAMILTONMS","Cypress, TX",194726,"2020-08-01",0,0,0,43853.07,42773.08,-2.4627466218442602,0,0,0]
[{"$f":"INDEX(Lookup!$A$1:$A$126,MATCH(DataYY03!C172,Lookup!$C$1:$C$126,0))","v":"Elementary School"},"Water","HANCOCKES","Houston, TX",88795,"1901-01-01",0,0,0,15772.21,15014.47,-4.8042728317718302,0,0,0]
[{"$f":"INDEX(Lookup!$A$1:$A$126,MATCH(DataYY03!C173,Lookup!$C$1:$C$126,0))","v":"Elementary School"},"Water","HEMMENWAYES","Katy, TX",101091,"2020-08-01",0,0,0,16901.79,8951.7199999999993,-47.036852309725802,0,0,0]
[{"$f":"INDEX(Lookup!$A$1:$A$126,MATCH(DataYY03!C174,Lookup!$C$1:$C$126,0))","v":"Elementary School"},"Water","HOLBROOKES","Houston, TX",99937,"1901-01-01",0,0,0,24898.799999999999,14767.47,-40.690033254614697,0,0,0]
[{"$f":"INDEX(Lookup!$A$1:$A$126,MATCH(DataYY03!C175,Lookup!$C$1:$C$126,0))","v":"Elementary School"},"Water","HOLMSLEYES","Houston, TX",81704,"2020-08-01",0,0,0,21351.14,9276.7099999999991,-56.5516876382245,0,0,0]
[{"$f":"INDEX(Lookup!$A$1:$A$126,MATCH(DataYY03!C176,Lookup!$C$1:$C$126,0))","v":"Elementary School"},"Water","HOOVERES","Katy, TX",112519,"1901-01-01",0,0,0,12176.35,11483.2,-5.6925926078011901,0,0,0]
[{"$f":"INDEX(Lookup!$A$1:$A$126,MATCH(DataYY03!C177,Lookup!$C$1:$C$126,0))","v":"Middle School"},"Water","HOPPERMS","Cypress, TX",226178,"1901-01-01",0,0,0,57014.080000000002,45494,-20.205675510330099,0,0,0]
[{"$f":"INDEX(Lookup!$A$1:$A$126,MATCH(DataYY03!C178,Lookup!$C$1:$C$126,0))","v":"Elementary School"},"Water","HORNEES","Houston, TX",87881,"1901-01-01",0,0,0,14805.06,10757.76,-27.3372752288745,0,0,0]
[{"$f":"INDEX(Lookup!$A$1:$A$126,MATCH(DataYY03!C179,Lookup!$C$1:$C$126,0))","v":"Administration"},"Water","ISCA","Houston, TX",132467,"1901-01-01",0,0,0,15246.42,11852.77,-22.258667936473,0,0,0]
[{"$f":"INDEX(Lookup!$A$1:$A$126,MATCH(DataYY03!C180,Lookup!$C$1:$C$126,0))","v":"Administration"},"Water","ISCW","Houston, TX",35364,"1901-01-01",0,0,0,2466.81,2007.61,-18.615134525966699,0,0,0]
[{"$f":"INDEX(Lookup!$A$1:$A$126,MATCH(DataYY03!C181,Lookup!$C$1:$C$126,0))","v":"Administration"},"Water","JARVISCENTRALPLANT","Cypress, TX",12152,"1901-01-01",0,0,0,104532.28,126377.24,20.897812618264901,0,0,0]
[{"$f":"INDEX(Lookup!$A$1:$A$126,MATCH(DataYY03!C182,Lookup!$C$1:$C$126,0))","v":"High School"},"Water","JERSEYVILLAGEHS","Houston, TX",513473,"2020-05-01",0,0,0,64990.38,23893.66,-63.235081869039703,0,0,0]
[{"$f":"INDEX(Lookup!$A$1:$A$126,MATCH(DataYY03!C183,Lookup!$C$1:$C$126,0))","v":"Elementary School"},"Water","JOWELLES","Katy, TX",73726,"1901-01-01",0,0,0,8052.95,6475.7,-19.5859902271838,0,0,0]
[{"$f":"INDEX(Lookup!$A$1:$A$126,MATCH(DataYY03!C184,Lookup!$C$1:$C$126,0))","v":"Middle School"},"Water","KAHLAMS","Houston, TX",221601,"1901-01-01",0,0,0,37709.22,50737.24,34.548632933802402,0,0,0]
[{"$f":"INDEX(Lookup!$A$1:$A$126,MATCH(DataYY03!C185,Lookup!$C$1:$C$126,0))","v":"Elementary School"},"Water","KEITHES","Cypress, TX",95518,"1901-01-01",0,0,0,14048.4,13828,-1.56886193445517,0,0,0]
[{"$f":"INDEX(Lookup!$A$1:$A$126,MATCH(DataYY03!C186,Lookup!$C$1:$C$126,0))","v":"Elementary School"},"Water","KIRKES","Houston, TX",93897,"1901-01-01",0,0,0,16334.6,15713,-3.8054191715744499,0,0,0]
[{"$f":"INDEX(Lookup!$A$1:$A$126,MATCH(DataYY03!C187,Lookup!$C$1:$C$126,0))","v":"Middle School"},"Water","LABAYMS","Houston, TX",190510,"2020-05-01",0,0,0,32478.400000000001,46755.8,43.959677816641197,0,0,0]
[{"$f":"INDEX(Lookup!$A$1:$A$126,MATCH(DataYY03!C188,Lookup!$C$1:$C$126,0))","v":"High School"},"Water","LANGHAMCREEKHS","Houston, TX",535686,"1901-01-01",0,0,0,67166.53,33994.879999999997,-49.387172450326098,0,0,0]
[{"$f":"INDEX(Lookup!$A$1:$A$126,MATCH(DataYY03!C189,Lookup!$C$1:$C$126,0))","v":"Elementary School"},"Water","LEEES","Houston, TX",95352,"1901-01-01",0,0,0,17065.599999999999,12978.26,-23.950754734670902,0,0,0]
[{"$f":"INDEX(Lookup!$A$1:$A$126,MATCH(DataYY03!C190,Lookup!$C$1:$C$126,0))","v":"Elementary School"},"Water","LIEDERES","Houston, TX",88406,"1901-01-01",0,0,0,14361.07,16001.97,11.426028840469399,0,0,0]
[{"$f":"INDEX(Lookup!$A$1:$A$126,MATCH(DataYY03!C191,Lookup!$C$1:$C$126,0))","v":"Elementary School"},"Water","LOWERYES","Houston, TX",78614,"2020-05-05",0,0,0,11260.81,8933.7000000000007,-20.665564910517102,0,0,0]
[{"$f":"INDEX(Lookup!$A$1:$A$126,MATCH(DataYY03!C192,Lookup!$C$1:$C$126,0))","v":"Administration"},"Water","MAINTENANCEOPER","Houston, TX",36679,"2020-05-01",0,0,0,5886.4,8189.64,39.128159826039699,0,0,0]
[{"$f":"INDEX(Lookup!$A$1:$A$126,MATCH(DataYY03!C193,Lookup!$C$1:$C$126,0))","v":"Elementary School"},"Water","MATZKEMILLSES","Houston, TX",124682,"1901-01-01",0,0,0,21247.98,22325.279999999999,5.0701290193232502,0,0,0]
[{"$f":"INDEX(Lookup!$A$1:$A$126,MATCH(DataYY03!C194,Lookup!$C$1:$C$126,0))","v":"Elementary School"},"Water","MCFEEES","Katy, TX",105539,"1901-01-01",0,0,0,20454.78,16260.94,-20.502982676909799,0,0,0]
[{"$f":"INDEX(Lookup!$A$1:$A$126,MATCH(DataYY03!C195,Lookup!$C$1:$C$126,0))","v":"Elementary School"},"Water","METCALFES","Houston, TX",85120,"2020-05-05",0,0,0,14112.07,10696.51,-24.2031112374017,0,0,0]
[{"$f":"INDEX(Lookup!$A$1:$A$126,MATCH(DataYY03!C196,Lookup!$C$1:$C$126,0))","v":"Elementary School"},"Water","MILLSAPES","Cypress, TX",77324,"1901-01-01",0,0,0,16683.240000000002,15015.36,-9.9973386464499701,0,0,0]
[{"$f":"INDEX(Lookup!$A$1:$A$126,MATCH(DataYY03!C197,Lookup!$C$1:$C$126,0))","v":"Elementary School"},"Water","MOOREES","Houston, TX",83063,"2020-05-01",0,0,0,9886.1,8677.0499999999993,-12.2297973922983,0,0,0]
[{"$f":"INDEX(Lookup!$A$1:$A$126,MATCH(DataYY03!C198,Lookup!$C$1:$C$126,0))","v":"Elementary School"},"Water","OWENSES","Houston, TX",85590,"2020-05-01",0,0,0,10452.6,7858.33,-24.819375083711201,0,0,0]
[{"$f":"INDEX(Lookup!$A$1:$A$126,MATCH(DataYY03!C199,Lookup!$C$1:$C$126,0))","v":"Elementary School"},"Water","POPEES","Cypress, TX",112970,"1901-01-01",0,0,0,16211.05,14163.56,-12.6302121084075,0,0,0]
[{"$f":"INDEX(Lookup!$A$1:$A$126,MATCH(DataYY03!C200,Lookup!$C$1:$C$126,0))","v":"Elementary School"},"Water","POSTES","Houston, TX",104852,"1901-01-01",0,0,0,23845.75,18006.599999999999,-24.487172766635599,0,0,0]
[{"$f":"INDEX(Lookup!$A$1:$A$126,MATCH(DataYY03!C201,Lookup!$C$1:$C$126,0))","v":"Elementary School"},"Water","POSTMAES","Cypress, TX",98920,"1901-01-01",0,0,0,17074.66,16896.29,-1.04464744832401,0,0,0]
[{"$f":"INDEX(Lookup!$A$1:$A$126,MATCH(DataYY03!C202,Lookup!$C$1:$C$126,0))","v":"Elementary School"},"Water","REEDES","Houston, TX",90012,"1901-01-01",0,0,0,10010.799999999999,7810.2,-21.982259160107098,0,0,0]
[{"$f":"INDEX(Lookup!$A$1:$A$126,MATCH(DataYY03!C203,Lookup!$C$1:$C$126,0))","v":"Elementary School"},"Water","RENNELLES","Cypress, TX",113621,"2019-08-01",0,0,0,18244.259999999998,14348.24,-21.354771308893898,0,0,0]
[{"$f":"INDEX(Lookup!$A$1:$A$126,MATCH(DataYY03!C204,Lookup!$C$1:$C$126,0))","v":"Elementary School"},"Water","ROBINSONES","Katy, TX",98532,"2020-05-05",0,0,0,13800.3,11280.64,-18.2580088838648,0,0,0]
[{"$f":"INDEX(Lookup!$A$1:$A$126,MATCH(DataYY03!C205,Lookup!$C$1:$C$126,0))","v":"Elementary School"},"Water","ROBISONES","Cypress, TX",93882,"2020-05-01",0,0,0,16465.900000000001,9963.9,-39.487668454199301,0,0,0]
[{"$f":"INDEX(Lookup!$A$1:$A$126,MATCH(DataYY03!C206,Lookup!$C$1:$C$126,0))","v":"Middle School"},"Water","SALYARDSMS","Cypress, TX",242116,"2020-05-01",0,0,0,25974.6,25723.65,-0.96613614839112105,0,0,0]
[{"$f":"INDEX(Lookup!$A$1:$A$126,MATCH(DataYY03!C207,Lookup!$C$1:$C$126,0))","v":"Elementary School"},"Water","SAMPSONES","Cypress, TX",96096,"1901-01-01",0,0,0,16291.8,16911.349999999999,3.8028333271952799,0,0,0]
[{"$f":"INDEX(Lookup!$A$1:$A$126,MATCH(DataYY03!C208,Lookup!$C$1:$C$126,0))","v":"Administration"},"Water","SATELLITECOLDFOODWAREHOUSE","Cypress, TX",22020,"1901-01-01",0,0,0,1006.96,1264.74,25.599825216493201,0,0,0]
[{"$f":"INDEX(Lookup!$A$1:$A$126,MATCH(DataYY03!C209,Lookup!$C$1:$C$126,0))","v":"Elementary School"},"Water","SHERIDANES","Katy, TX",92874,"2020-08-01",0,0,0,16229.76,14884.44,-8.2892168460901505,0,0,0]
[{"$f":"INDEX(Lookup!$A$1:$A$126,MATCH(DataYY03!C210,Lookup!$C$1:$C$126,0))","v":"Middle School"},"Water","SMITHMS","Cypress, TX",233159,"2020-08-01",0,0,0,20159.22,13739.02,-31.847462352213999,0,0,0]
[{"$f":"INDEX(Lookup!$A$1:$A$126,MATCH(DataYY03!C211,Lookup!$C$1:$C$126,0))","v":"Middle School"},"Water","SPILLANEMS","Cypress, TX",235889,"1901-01-01",0,0,0,21729.72,16397.88,-24.537085613620398,0,0,0]
[{"$f":"INDEX(Lookup!$A$1:$A$126,MATCH(DataYY03!C212,Lookup!$C$1:$C$126,0))","v":"Elementary School"},"Water","SWENKEES","Cypress, TX",107914,"1901-01-01",0,0,0,14503.05,11506.95,-20.658413230320502,0,0,0]
[{"$f":"INDEX(Lookup!$A$1:$A$126,MATCH(DataYY03!C213,Lookup!$C$1:$C$126,0))","v":"Middle School"},"Water","THORNTONMS","Katy, TX",202739,"2020-08-01",0,0,0,61733.08,48721.42,-21.0772895180347,0,0,0]
[{"$f":"INDEX(Lookup!$A$1:$A$126,MATCH(DataYY03!C214,Lookup!$C$1:$C$126,0))","v":"Elementary School"},"Water","TIPPSES","Houston, TX",101727,"1901-01-01",0,0,0,19551.09,14121.17,-27.7729783863713,0,0,0]
[{"$f":"INDEX(Lookup!$A$1:$A$126,MATCH(DataYY03!C215,Lookup!$C$1:$C$126,0))","v":"Middle School"},"Water","TRUITTMS","Houston, TX",209274,"2020-05-01",0,0,0,36118.76,28008.880000000001,-22.453373260876099,0,0,0]
[{"$f":"INDEX(Lookup!$A$1:$A$126,MATCH(DataYY03!C216,Lookup!$C$1:$C$126,0))","v":"Elementary School"},"Water","WALKERES","Katy, TX",98321,"1901-01-01",0,0,0,13971.37,9205.52,-34.111543821400502,0,0,0]
[{"$f":"INDEX(Lookup!$A$1:$A$126,MATCH(DataYY03!C217,Lookup!$C$1:$C$126,0))","v":"Elementary School"},"Water","WARNERES","Cypress, TX",98451,"2020-08-01",0,0,0,17013.05,11529.73,-32.230082201604098,0,0,0]
[{"$f":"INDEX(Lookup!$A$1:$A$126,MATCH(DataYY03!C218,Lookup!$C$1:$C$126,0))","v":"Middle School"},"Water","WATKINSMS","Houston, TX",220237,"2020-08-01",0,0,0,45149.88,58115.88,28.7176842994932,0,0,0]
[{"$f":"INDEX(Lookup!$A$1:$A$126,MATCH(DataYY03!C219,Lookup!$C$1:$C$126,0))","v":"Elementary School"},"Water","WELLSES","Cypress, TX",122878,"1901-01-01",0,0,0,17332.599999999999,25120.67,44.933074091596197,0,0,0]
[{"$f":"INDEX(Lookup!$A$1:$A$126,MATCH(DataYY03!C220,Lookup!$C$1:$C$126,0))","v":"Administration"},"Water","WESTGREENAGSCIENCECENTER","Cypress, TX",20124,"1901-01-01",0,0,0,1789.7,1349.88,-24.575068447225799,0,0,0]
[{"$f":"INDEX(Lookup!$A$1:$A$126,MATCH(DataYY03!C221,Lookup!$C$1:$C$126,0))","v":"Administration"},"Water","WESTGREENTRANS","Cypress, TX",45340,"1901-01-01",0,0,0,5440.59,4213.22,-22.559501818736599,0,0,0]
[{"$f":"INDEX(Lookup!$A$1:$A$126,MATCH(DataYY03!C222,Lookup!$C$1:$C$126,0))","v":"Elementary School"},"Water","WILLBERNES","Houston, TX",89993,"1901-01-01",0,0,0,9175.36,8386.65,-8.5959569978725607,0,0,0]
[{"$f":"INDEX(Lookup!$A$1:$A$126,MATCH(DataYY03!C223,Lookup!$C$1:$C$126,0))","v":"Elementary School"},"Water","WILSONES","Houston, TX",84992,"1901-01-01",0,0,0,10379.75,12232.65,17.851104313687699,0,0,0]
[{"$f":"INDEX(Lookup!$A$1:$A$126,MATCH(DataYY03!C224,Lookup!$C$1:$C$126,0))","v":"Elementary School"},"Water","WOODARDES","Cypress, TX",116974,"2020-08-01",0,0,0,15498.23,12026.27,-22.402300133628199,0,0,0]
[{"$f":"INDEX(Lookup!$A$1:$A$126,MATCH(DataYY03!C225,Lookup!$C$1:$C$126,0))","v":"Elementary School"},"Water","YEAGERES","Houston, TX",81794,"1901-01-01",0,0,0,14714.74,8685.5,-40.9741524484972,0,0,0]
[{"$f":"INDEX(Lookup!$A$1:$A$126,MATCH(DataYY03!C226,Lookup!$C$1:$C$126,0))","v":"Special School"},"Irrigation","ALCWEST","Katy, TX",50839,"2000-01-01",0,0,0,511.7,536.1,4.7684189955051792,0,0,0]
[{"$f":"INDEX(Lookup!$A$1:$A$126,MATCH(DataYY03!C227,Lookup!$C$1:$C$126,0))","v":"Elementary School"},"Irrigation","ANDREES","Cypress, TX",107836,"2000-01-01",0,0,0,268.56,2250.14,737.85373845695563,0,0,0]
[{"$f":"INDEX(Lookup!$A$1:$A$126,MATCH(DataYY03!C228,Lookup!$C$1:$C$126,0))","v":"Middle School"},"Irrigation","ANTHONYMS","Cypress, TX",244123,"2000-01-01",0,0,0,15808,30317.1,91.783274291497989,0,0,0]
[{"$f":"INDEX(Lookup!$A$1:$A$126,MATCH(DataYY03!C229,Lookup!$C$1:$C$126,0))","v":"Middle School"},"Irrigation","ARAGONMS","Houston, TX",219821,"2000-01-01",0,0,0,13666.94,2398.4299999999998,-82.450863177858395,0,0,0]
[{"$f":"INDEX(Lookup!$A$1:$A$126,MATCH(DataYY03!C230,Lookup!$C$1:$C$126,0))","v":"Administration"},"Irrigation","BERRYCENTER","Cypress, TX",491434,"2000-01-01",0,0,0,29560,35423.279999999999,19.835182679296349,0,0,0]
[{"$f":"INDEX(Lookup!$A$1:$A$126,MATCH(DataYY03!C231,Lookup!$C$1:$C$126,0))","v":"Elementary School"},"Irrigation","BIRKESES","Houston, TX",106488,"2000-01-01",0,0,0,1821.28,410.72,-77.448827198453841,0,0,0]
[{"$f":"INDEX(Lookup!$A$1:$A$126,MATCH(DataYY03!C232,Lookup!$C$1:$C$126,0))","v":"Elementary School"},"Irrigation","BLACKES","Cypress, TX",97384,"2000-01-01",0,0,0,5169.04,730.68,-85.864299753919497,0,0,0]
[{"$f":"INDEX(Lookup!$A$1:$A$126,MATCH(DataYY03!C233,Lookup!$C$1:$C$126,0))","v":"Administration"},"Irrigation","BRADLEYPOLICESTATION","Cypress, TX",18144,"2000-01-01",0,0,0,381.05,659.9,73.179372785723658,0,0,0]
[{"$f":"INDEX(Lookup!$A$1:$A$126,MATCH(DataYY03!C234,Lookup!$C$1:$C$126,0))","v":"High School"},"Irrigation","BRIDGELANDHS","Cypress, TX",573468,"2000-01-01",0,0,0,63729.64,81125.45,27.296262775060395,0,0,0]
[{"$f":"INDEX(Lookup!$A$1:$A$126,MATCH(DataYY03!C235,Lookup!$C$1:$C$126,0))","v":"Middle School"},"Irrigation","COOKMS","Houston, TX",204629,"2000-01-01",0,0,0,6424.86,4282.51,-33.344695448616783,0,0,0]
[{"$f":"INDEX(Lookup!$A$1:$A$126,MATCH(DataYY03!C236,Lookup!$C$1:$C$126,0))","v":"High School"},"Irrigation","CY-FALLSHS","Houston, TX",578719,"2000-01-01",0,0,0,1621.9,6666.39,311.02349096738396,0,0,0]
[{"$f":"INDEX(Lookup!$A$1:$A$126,MATCH(DataYY03!C237,Lookup!$C$1:$C$126,0))","v":"High School"},"Irrigation","CY-LAKESHS","Katy, TX",520212,"2000-01-01",0,0,0,40928.129999999997,43179.14,5.4999092311327198,0,0,0]
[{"$f":"INDEX(Lookup!$A$1:$A$126,MATCH(DataYY03!C238,Lookup!$C$1:$C$126,0))","v":"High School"},"Irrigation","CY-PARKHS","Cypress, TX",590057,"2000-01-01",0,0,0,48963.86,54123.79,10.538241878806122,0,0,0]
[{"$f":"INDEX(Lookup!$A$1:$A$126,MATCH(DataYY03!C239,Lookup!$C$1:$C$126,0))","v":"High School"},"Irrigation","CY-RANCHHS","Cypress, TX",530203,"2000-01-01",0,0,0,45959.53,49972.65,8.7318560481362617,0,0,0]
[{"$f":"INDEX(Lookup!$A$1:$A$126,MATCH(DataYY03!C240,Lookup!$C$1:$C$126,0))","v":"High School"},"Irrigation","CY-RIDGEHS","Houston, TX",497661,"2000-01-01",0,0,0,30497.13,23457.8,-23.081942464749964,0,0,0]
[{"$f":"INDEX(Lookup!$A$1:$A$126,MATCH(DataYY03!C241,Lookup!$C$1:$C$126,0))","v":"High School"},"Irrigation","CY-SPRINGSHS","Cypress, TX",477795,"2000-01-01",0,0,0,26599.72,38644.699999999997,45.28235635563081,0,0,0]
[{"$f":"INDEX(Lookup!$A$1:$A$126,MATCH(DataYY03!C242,Lookup!$C$1:$C$126,0))","v":"High School"},"Irrigation","CY-WOODSHS","Cypress, TX",535914,"2000-01-01",0,0,0,67044.02,67694.820000000007,0.97070551557021789,0,0,0]
[{"$f":"INDEX(Lookup!$A$1:$A$126,MATCH(DataYY03!C243,Lookup!$C$1:$C$126,0))","v":"Elementary School"},"Irrigation","DANISHES","Houston, TX",99588,"2000-01-01",0,0,0,434.16,434.16,0,0,0,0]
[{"$f":"INDEX(Lookup!$A$1:$A$126,MATCH(DataYY03!C244,Lookup!$C$1:$C$126,0))","v":"Middle School"},"Irrigation","DEANMS","Houston, TX",213572,"2000-01-01",0,0,0,16439.54,11904.49,-27.586234164702905,0,0,0]
[{"$f":"INDEX(Lookup!$A$1:$A$126,MATCH(DataYY03!C245,Lookup!$C$1:$C$126,0))","v":"Elementary School"},"Irrigation","DURYEAES","Katy, TX",97959,"2000-01-01",0,0,0,4492.8,2785.2,-38.00747863247863,0,0,0]
[{"$f":"INDEX(Lookup!$A$1:$A$126,MATCH(DataYY03!C246,Lookup!$C$1:$C$126,0))","v":"Administration"},"Irrigation","ELDRIDGETRANS","Houston, TX",26451,"2000-01-01",0,0,0,4006.3,473.9,-88.171130469510516,0,0,0]
[{"$f":"INDEX(Lookup!$A$1:$A$126,MATCH(DataYY03!C247,Lookup!$C$1:$C$126,0))","v":"Elementary School"},"Irrigation","EMERYES","Katy, TX",95366,"2000-01-01",0,0,0,2723.67,660,-75.767989514148198,0,0,0]
[{"$f":"INDEX(Lookup!$A$1:$A$126,MATCH(DataYY03!C248,Lookup!$C$1:$C$126,0))","v":"Elementary School"},"Irrigation","FARNEYES","Cypress, TX",95036,"2000-01-01",0,0,0,4379.3500000000004,2901.92,-33.736285065135242,0,0,0]
[{"$f":"INDEX(Lookup!$A$1:$A$126,MATCH(DataYY03!C249,Lookup!$C$1:$C$126,0))","v":"Elementary School"},"Irrigation","GLEASONES","Houston, TX",91424,"2000-01-01",0,0,0,1519.7,180.04,-88.152924919391992,0,0,0]
[{"$f":"INDEX(Lookup!$A$1:$A$126,MATCH(DataYY03!C250,Lookup!$C$1:$C$126,0))","v":"Middle School"},"Irrigation","GOODSONMS","Cypress, TX",218801,"2000-01-01",0,0,0,20587.47,19778.84,-3.9277774296695998,0,0,0]
[{"$f":"INDEX(Lookup!$A$1:$A$126,MATCH(DataYY03!C251,Lookup!$C$1:$C$126,0))","v":"Middle School"},"Irrigation","HAMILTONMS","Cypress, TX",192751,"2000-01-01",0,null,0,0,34194.78,0,0,null,0]
[{"$f":"INDEX(Lookup!$A$1:$A$126,MATCH(DataYY03!C252,Lookup!$C$1:$C$126,0))","v":"Elementary School"},"Irrigation","HEMMENWAYES","Katy, TX",96483,"2000-01-01",0,0,0,1253.53,2555.25,103.84434357374774,0,0,0]
[{"$f":"INDEX(Lookup!$A$1:$A$126,MATCH(DataYY03!C253,Lookup!$C$1:$C$126,0))","v":"Elementary School"},"Irrigation","HOOVERES","Katy, TX",112519,"2000-01-01",0,0,0,15229.9,9749,-35.987760917668531,0,0,0]
[{"$f":"INDEX(Lookup!$A$1:$A$126,MATCH(DataYY03!C254,Lookup!$C$1:$C$126,0))","v":"Middle School"},"Irrigation","HOPPERMS","Cypress, TX",226178,"2000-01-01",0,0,0,12963.99,16285.6,25.621818591344176,0,0,0]
[{"$f":"INDEX(Lookup!$A$1:$A$126,MATCH(DataYY03!C255,Lookup!$C$1:$C$126,0))","v":"Administration"},"Irrigation","ISCW","Houston, TX",35364,"2000-01-01",0,0,0,909.25,862.37,-5.1558977178993679,0,0,0]
[{"$f":"INDEX(Lookup!$A$1:$A$126,MATCH(DataYY03!C256,Lookup!$C$1:$C$126,0))","v":"Administration"},"Irrigation","JERSEYVILLAGESTADIUM","Houston, TX",2385,"2000-01-01",0,0,0,31598.48,18228.52,-42.312035262455666,0,0,0]
[{"$f":"INDEX(Lookup!$A$1:$A$126,MATCH(DataYY03!C257,Lookup!$C$1:$C$126,0))","v":"Elementary School"},"Irrigation","JOWELLES","Katy, TX",73726,"2000-01-01",0,0,0,14484.1,10404.65,-28.165022334836131,0,0,0]
[{"$f":"INDEX(Lookup!$A$1:$A$126,MATCH(DataYY03!C258,Lookup!$C$1:$C$126,0))","v":"Middle School"},"Irrigation","KAHLAMS","Houston, TX",221601,"2000-01-01",0,0,0,12002.28,20531.8,71.065830825476496,0,0,0]
[{"$f":"INDEX(Lookup!$A$1:$A$126,MATCH(DataYY03!C259,Lookup!$C$1:$C$126,0))","v":"Elementary School"},"Irrigation","KEITHES","Cypress, TX",95518,"2000-01-01",0,0,0,2286.15,3712.8,62.404041729545305,0,0,0]
[{"$f":"INDEX(Lookup!$A$1:$A$126,MATCH(DataYY03!C260,Lookup!$C$1:$C$126,0))","v":"Elementary School"},"Irrigation","KIRKES","Houston, TX",93897,"2000-01-01",0,0,0,885.12,767.35,-13.305540491684745,0,0,0]
[{"$f":"INDEX(Lookup!$A$1:$A$126,MATCH(DataYY03!C261,Lookup!$C$1:$C$126,0))","v":"High School"},"Irrigation","LANGHAMCREEKHS","Houston, TX",535686,"2000-01-01",0,0,0,31164.85,38226.629999999997,22.659438437855471,0,0,0]
[{"$f":"INDEX(Lookup!$A$1:$A$126,MATCH(DataYY03!C262,Lookup!$C$1:$C$126,0))","v":"Elementary School"},"Irrigation","LEEES","Houston, TX",95352,"2000-01-01",0,0,0,12713.24,7017.64,-44.800538651044107,0,0,0]
[{"$f":"INDEX(Lookup!$A$1:$A$126,MATCH(DataYY03!C263,Lookup!$C$1:$C$126,0))","v":"Elementary School"},"Irrigation","LOWERYES","Houston, TX",78614,"2020-05-05",0,0,0,170.23,3041.5,1686.7003465899077,0,0,0]
[{"$f":"INDEX(Lookup!$A$1:$A$126,MATCH(DataYY03!C264,Lookup!$C$1:$C$126,0))","v":"Elementary School"},"Irrigation","MATZKEMILLSES","Houston, TX",124682,"2000-01-01",0,0,0,3774.24,2370.96,-37.180465471194204,0,0,0]
[{"$f":"INDEX(Lookup!$A$1:$A$126,MATCH(DataYY03!C265,Lookup!$C$1:$C$126,0))","v":"Elementary School"},"Irrigation","MCFEEES","Katy, TX",107075,"2000-01-01",0,0,0,5404.5,6923.5,28.106207789804795,0,0,0]
[{"$f":"INDEX(Lookup!$A$1:$A$126,MATCH(DataYY03!C266,Lookup!$C$1:$C$126,0))","v":"Elementary School"},"Irrigation","POPEES","Cypress, TX",112970,"2000-01-01",0,0,0,3052.2,6976.35,128.56791822292118,0,0,0]
[{"$f":"INDEX(Lookup!$A$1:$A$126,MATCH(DataYY03!C267,Lookup!$C$1:$C$126,0))","v":"Elementary School"},"Irrigation","POSTMAES","Cypress, TX",100456,"2000-01-01",0,0,0,2819.96,2957.75,4.8862395211279592,0,0,0]
[{"$f":"INDEX(Lookup!$A$1:$A$126,MATCH(DataYY03!C268,Lookup!$C$1:$C$126,0))","v":"Elementary School"},"Irrigation","RENNELLES","Cypress, TX",110549,"2000-01-01",0,0,0,17228.650000000001,11811.74,-31.441291105222987,0,0,0]
[{"$f":"INDEX(Lookup!$A$1:$A$126,MATCH(DataYY03!C269,Lookup!$C$1:$C$126,0))","v":"Elementary School"},"Irrigation","ROBINSONES","Katy, TX",98532,"2020-05-05",0,0,0,3180.69,6987.25,119.67717696474665,0,0,0]
[{"$f":"INDEX(Lookup!$A$1:$A$126,MATCH(DataYY03!C270,Lookup!$C$1:$C$126,0))","v":"Elementary School"},"Irrigation","ROBISONES","Cypress, TX",93882,"2020-05-01",0,0,0,5217.79,903.92,-82.676190494443048,0,0,0]
[{"$f":"INDEX(Lookup!$A$1:$A$126,MATCH(DataYY03!C271,Lookup!$C$1:$C$126,0))","v":"Middle School"},"Irrigation","SALYARDSMS","Cypress, TX",242116,"2020-05-01",0,0,0,7819.7,6211.05,-20.571761065002491,0,0,0]
[{"$f":"INDEX(Lookup!$A$1:$A$126,MATCH(DataYY03!C272,Lookup!$C$1:$C$126,0))","v":"Elementary School"},"Irrigation","SAMPSONES","Cypress, TX",96096,"2000-01-01",0,0,0,1102.68,454.45,-58.786774041426341,0,0,0]
[{"$f":"INDEX(Lookup!$A$1:$A$126,MATCH(DataYY03!C273,Lookup!$C$1:$C$126,0))","v":"Administration"},"Irrigation","SATELLITECOLDFOODWAREHOUSE","Cypress, TX",22020,"2000-01-01",0,0,0,1647.4,2264.88,37.482092995022455,0,0,0]
[{"$f":"INDEX(Lookup!$A$1:$A$126,MATCH(DataYY03!C274,Lookup!$C$1:$C$126,0))","v":"Middle School"},"Irrigation","SMITHMS","Cypress, TX",230087,"2020-05-01",0,0,0,7453.58,10608.59,42.328786972166398,0,0,0]
[{"$f":"INDEX(Lookup!$A$1:$A$126,MATCH(DataYY03!C275,Lookup!$C$1:$C$126,0))","v":"Middle School"},"Irrigation","SPILLANEMS","Cypress, TX",235889,"2000-01-01",0,0,0,14974.79,6670.74,-55.453532236512167,0,0,0]
[{"$f":"INDEX(Lookup!$A$1:$A$126,MATCH(DataYY03!C276,Lookup!$C$1:$C$126,0))","v":"Elementary School"},"Irrigation","SWENKEES","Cypress, TX",107914,"2000-01-01",0,0,0,11701.4,16808.75,43.647341343770833,0,0,0]
[{"$f":"INDEX(Lookup!$A$1:$A$126,MATCH(DataYY03!C277,Lookup!$C$1:$C$126,0))","v":"Elementary School"},"Irrigation","TIPPSES","Houston, TX",101727,"2000-01-01",0,0,0,1090.25,540,-50.470075670717726,0,0,0]
[{"$f":"INDEX(Lookup!$A$1:$A$126,MATCH(DataYY03!C278,Lookup!$C$1:$C$126,0))","v":"Elementary School"},"Irrigation","WALKERES","Katy, TX",99857,"2020-05-01",0,0,0,2568.42,4897.38,90.676758474081339,0,0,0]
[{"$f":"INDEX(Lookup!$A$1:$A$126,MATCH(DataYY03!C279,Lookup!$C$1:$C$126,0))","v":"Elementary School"},"Irrigation","WARNERES","Cypress, TX",101523,"2020-05-01",0,0,0,7885.27,6372.78,-19.181207491943841,0,0,0]
[{"$f":"INDEX(Lookup!$A$1:$A$126,MATCH(DataYY03!C280,Lookup!$C$1:$C$126,0))","v":"Elementary School"},"Irrigation","WELLSES","Cypress, TX",122878,"2000-01-01",0,0,0,15225.45,4471.3999999999996,-70.632066704103977,0,0,0]
[{"$f":"INDEX(Lookup!$A$1:$A$126,MATCH(DataYY03!C281,Lookup!$C$1:$C$126,0))","v":"Administration"},"Irrigation","WESTGREENTRANS","Cypress, TX",45340,"2000-01-01",0,0,0,248.79,746.77,200.160778166325,0,0,0]
[{"$f":"INDEX(Lookup!$A$1:$A$126,MATCH(DataYY03!C282,Lookup!$C$1:$C$126,0))","v":"Elementary School"},"Irrigation","WOODARDES","Cypress, TX",115438,"2000-01-01",0,0,0,1748.67,916.27,-47.601891723424089,0,0,0]
[{"$f":"INDEX(Lookup!$A$1:$A$126,MATCH(DataYY03!C283,Lookup!$C$1:$C$126,0))","v":"Elementary School"},"Irrigation","YEAGERES","Houston, TX",81794,"2000-01-01",0,0,0,2529.86,1617.69,-36.056145399350164,0,0,0]
[{"$f":"INDEX(Lookup!$A$1:$A$126,MATCH(DataYY03!C284,Lookup!$C$1:$C$126,0))","v":"Elementary School"},"Nat_Gas","ADAM-ES","Houston, TX",103177,367,593.28,550.02,-7.2916666666666696,2522.4899999999998,2148.5,-14.826223295236099,0,0,0]
[{"$f":"INDEX(Lookup!$A$1:$A$126,MATCH(DataYY03!C285,Lookup!$C$1:$C$126,0))","v":"Special School"},"Nat_Gas","ALCABC","Houston, TX",56061,367,546.92999999999995,307.97000000000003,-43.691148775894497,2352.61,1420.34,-39.627052507640499,0,0,0]
[{"$f":"INDEX(Lookup!$A$1:$A$126,MATCH(DataYY03!C286,Lookup!$C$1:$C$126,0))","v":"Special School"},"Nat_Gas","ALCWEST","Katy, TX",50839,367,1103.1300000000001,1142.27,3.54808590102708,4539.5600000000004,4094.35,-9.8073381561208599,0,0,0]
[{"$f":"INDEX(Lookup!$A$1:$A$126,MATCH(DataYY03!C287,Lookup!$C$1:$C$126,0))","v":"Elementary School"},"Nat_Gas","ANDREES","Cypress, TX",106300,43952,597.4,920.82,54.137931034482797,2525.89,3215.66,27.307998368891798,0,0,0]
[{"$f":"INDEX(Lookup!$A$1:$A$126,MATCH(DataYY03!C288,Lookup!$C$1:$C$126,0))","v":"Middle School"},"Nat_Gas","ANTHONYMS","Cypress, TX",244123,367,1864.3,1505.86,-19.226519337016601,7472.64,6136.03,-17.8867174117849,0,0,0]
[{"$f":"INDEX(Lookup!$A$1:$A$126,MATCH(DataYY03!C289,Lookup!$C$1:$C$126,0))","v":"Middle School"},"Nat_Gas","ARAGONMS","Houston, TX",219821,367,1645.94,1616.07,-1.8147684605757199,6875.86,6290.08,-8.5193706678146395,0,0,0]
[{"$f":"INDEX(Lookup!$A$1:$A$126,MATCH(DataYY03!C290,Lookup!$C$1:$C$126,0))","v":"Middle School"},"Nat_Gas","ARNOLDMS","Cypress, TX",212235,43952,8152.45,10860.32,33.2154137713203,32549.53,37002.800000000003,13.681518596428299,0,0,0]
[{"$f":"INDEX(Lookup!$A$1:$A$126,MATCH(DataYY03!C291,Lookup!$C$1:$C$126,0))","v":"Elementary School"},"Nat_Gas","AULTES","Cypress, TX",91912,43952,415.09,371.83,-10.4218362282878,1928.01,1626.43,-15.642035051685401,0,0,0]
[{"$f":"INDEX(Lookup!$A$1:$A$126,MATCH(DataYY03!C292,Lookup!$C$1:$C$126,0))","v":"Elementary School"},"Nat_Gas","BANEES","Houston, TX",106804,367,831.21,777.65,-6.4436183395291202,3452.43,2883.4,-16.482014117592499,0,0,0]
[{"$f":"INDEX(Lookup!$A$1:$A$126,MATCH(DataYY03!C293,Lookup!$C$1:$C$126,0))","v":"Elementary School"},"Nat_Gas","BANGES","Houston, TX",89313,44044,600.49,541.78,-9.7770154373927998,2544.0700000000002,2136.86,-16.006241966612599,0,0,0]
[{"$f":"INDEX(Lookup!$A$1:$A$126,MATCH(DataYY03!C294,Lookup!$C$1:$C$126,0))","v":"Administration"},"Nat_Gas","BARKERTRANS","Houston, TX",22677,367,181.28,136.99,-24.431818181818201,930.36,700.01,-24.759232985080999,0,0,0]
[{"$f":"INDEX(Lookup!$A$1:$A$126,MATCH(DataYY03!C295,Lookup!$C$1:$C$126,0))","v":"Administration"},"Nat_Gas","BERRYCENTER","Cypress, TX",491434,367,3976.83,3363.98,-15.4105154105154,17847.88,13913.48,-22.044074702429601,0,0,0]
[{"$f":"INDEX(Lookup!$A$1:$A$126,MATCH(DataYY03!C296,Lookup!$C$1:$C$126,0))","v":"Elementary School"},"Nat_Gas","BIRKESES","Houston, TX",104952,44044,724.09,854.9,18.0654338549075,3262.68,3377.91,3.5317591673103101,0,0,0]
[{"$f":"INDEX(Lookup!$A$1:$A$126,MATCH(DataYY03!C297,Lookup!$C$1:$C$126,0))","v":"Elementary School"},"Nat_Gas","BLACKES","Cypress, TX",99456,44044,440.84,420.24,-4.6728971962616797,2042.57,1780.03,-12.8534150604386,0,0,0]
[{"$f":"INDEX(Lookup!$A$1:$A$126,MATCH(DataYY03!C298,Lookup!$C$1:$C$126,0))","v":"Middle School"},"Nat_Gas","BLEYLMS","Houston, TX",229363,367,3382.52,3514.36,3.89768574908648,13573.43,12694.45,-6.4757397356453001,0,0,0]
[{"$f":"INDEX(Lookup!$A$1:$A$126,MATCH(DataYY03!C299,Lookup!$C$1:$C$126,0))","v":"Administration"},"Nat_Gas","BRADLEYPOLICESTATION","Cypress, TX",19680,43952,224.54,186.43,-16.9724770642202,1063.72,844.94,-20.567442560072202,0,0,0]
[{"$f":"INDEX(Lookup!$A$1:$A$126,MATCH(DataYY03!C300,Lookup!$C$1:$C$126,0))","v":"Special School"},"Nat_Gas","BRAUTIGAMCENTER","Houston, TX",85895,43952,470.71,989.83,110.284463894967,1968.42,3467.41,76.151939118683998,0,0,0]
[{"$f":"INDEX(Lookup!$A$1:$A$126,MATCH(DataYY03!C301,Lookup!$C$1:$C$126,0))","v":"High School"},"Nat_Gas","BRIDGELANDHS","Cypress, TX",573468,367,3797.61,949.66,-74.993219419582303,15652.41,5580.82,-64.345298902852704,0,0,0]
[{"$f":"INDEX(Lookup!$A$1:$A$126,MATCH(DataYY03!C302,Lookup!$C$1:$C$126,0))","v":"Middle School"},"Nat_Gas","CAMPBELLMS","Houston, TX",228967,44044,2591.48,2046.61,-21.025437201907799,10568.97,7925.4,-25.012560353563298,0,0,0]
[{"$f":"INDEX(Lookup!$A$1:$A$126,MATCH(DataYY03!C303,Lookup!$C$1:$C$126,0))","v":"Administration"},"Nat_Gas","CFISDNATATORIUM","Houston, TX",49471,367,19882.09,16554.16,-16.738330829404799,68425.600000000006,53365.13,-22.009993335827499,0,0,0]
[{"$f":"INDEX(Lookup!$A$1:$A$126,MATCH(DataYY03!C304,Lookup!$C$1:$C$126,0))","v":"Middle School"},"Nat_Gas","COOKMS","Houston, TX",205797,43952,1356.51,2080.6,53.378891419893698,5516.56,7479.62,35.5848572298679,0,0,0]
[{"$f":"INDEX(Lookup!$A$1:$A$126,MATCH(DataYY03!C305,Lookup!$C$1:$C$126,0))","v":"Elementary School"},"Nat_Gas","COPELANDES","Houston, TX",86318,367,295.61,450.11,52.264808362369301,1497.1,1970.02,31.589072206265399,0,0,0]
[{"$f":"INDEX(Lookup!$A$1:$A$126,MATCH(DataYY03!C306,Lookup!$C$1:$C$126,0))","v":"High School"},"Nat_Gas","CY-CREEKHS","Houston, TX",527749,43952,7515.91,6711.48,-10.703028641907601,28020.25,23157.69,-17.353735245046,0,0,0]
["Special School","Nat_Gas","CY-FALLSAGVOC","Houston, TX",0,367,197.76,184.37,-6.7708333333333304,1147.3900000000001,1042.1400000000001,-9.17299261802874,0,0,0]
[{"$f":"INDEX(Lookup!$A$1:$A$126,MATCH(DataYY03!C308,Lookup!$C$1:$C$126,0))","v":"High School"},"Nat_Gas","CY-FALLSHS","Houston, TX",567967,43952,3750.23,4055.11,8.1296347157374296,14829.63,14095.3,-4.9517756006050098,0,0,0]
[{"$f":"INDEX(Lookup!$A$1:$A$126,MATCH(DataYY03!C309,Lookup!$C$1:$C$126,0))","v":"High School"},"Nat_Gas","CY-LAKESHS","Katy, TX",514068,43952,5499.17,5635.13,2.4723731035774499,22077.29,20429.439999999999,-7.4640048665393302,0,0,0]
[{"$f":"INDEX(Lookup!$A$1:$A$126,MATCH(DataYY03!C310,Lookup!$C$1:$C$126,0))","v":"High School"},"Nat_Gas","CY-PARKHS","Cypress, TX",590057,367,9222.6200000000008,12213.74,32.4324324324324,33891.4,40120.980000000003,18.381005210761401,0,0,0]
[{"$f":"INDEX(Lookup!$A$1:$A$126,MATCH(DataYY03!C311,Lookup!$C$1:$C$126,0))","v":"High School"},"Nat_Gas","CY-RANCHHS","Cypress, TX",527131,43952,4599.9799999999996,5032.58,9.4043887147335408,18799.78,18221.990000000002,-3.0733870289971499,0,0,0]
[{"$f":"INDEX(Lookup!$A$1:$A$126,MATCH(DataYY03!C312,Lookup!$C$1:$C$126,0))","v":"High School"},"Nat_Gas","CY-RIDGEHS","Houston, TX",502564,44044,5276.69,5687.66,7.7884052313097802,20806.02,20180.96,-3.0042266613220598,0,0,0]
[{"$f":"INDEX(Lookup!$A$1:$A$126,MATCH(DataYY03!C313,Lookup!$C$1:$C$126,0))","v":"High School"},"Nat_Gas","CY-SPRINGSHS","Cypress, TX",478615,44044,5105.71,5362.18,5.0231995158361897,20140.34,18479.64,-8.2456403417221402,0,0,0]
["Special School","Nat_Gas","CY-WOODSCARLTONCENTERKITCHEN","Cypress, TX",37977,367,30.9,22.66,-26.6666666666667,559.17999999999995,526.23,-5.8925569584033797,0,0,0]
[{"$f":"INDEX(Lookup!$A$1:$A$126,MATCH(DataYY03!C315,Lookup!$C$1:$C$126,0))","v":"High School"},"Nat_Gas","CY-WOODSHS","Cypress, TX",535914,367,5993.57,6698.09,11.7545970097955,23522.880000000001,23194.95,-1.3940894992449899,0,0,0]
[{"$f":"INDEX(Lookup!$A$1:$A$126,MATCH(DataYY03!C316,Lookup!$C$1:$C$126,0))","v":"Elementary School"},"Nat_Gas","DANISHES","Houston, TX",98052,43952,537.66,499.55,-7.0881226053639796,2389.9899999999998,2019.87,-15.4862572646747,0,0,0]
[{"$f":"INDEX(Lookup!$A$1:$A$126,MATCH(DataYY03!C317,Lookup!$C$1:$C$126,0))","v":"Middle School"},"Nat_Gas","DEANMS","Houston, TX",222788,44044,1466.72,1440.97,-1.75561797752809,6774.65,6164.47,-9.0068121600377893,0,0,0]
[{"$f":"INDEX(Lookup!$A$1:$A$126,MATCH(DataYY03!C318,Lookup!$C$1:$C$126,0))","v":"Elementary School"},"Nat_Gas","DURYEAES","Katy, TX",96423,43952,590.19000000000005,400.67,-32.111692844677101,2570.42,1717.72,-33.173566965709902,0,0,0]
[{"$f":"INDEX(Lookup!$A$1:$A$126,MATCH(DataYY03!C319,Lookup!$C$1:$C$126,0))","v":"Administration"},"Nat_Gas","ELC1","Houston, TX",6832,367,13.39,4.12,-69.230769230769198,322.98,287.89,-10.864449811133801,0,0,0]
[{"$f":"INDEX(Lookup!$A$1:$A$126,MATCH(DataYY03!C320,Lookup!$C$1:$C$126,0))","v":"Administration"},"Nat_Gas","ELDRIDGETRANS","Houston, TX",26451,367,270.89,245.14,-9.5057034220532302,1437.88,1223.5,-14.909450023645901,0,0,0]
[{"$f":"INDEX(Lookup!$A$1:$A$126,MATCH(DataYY03!C321,Lookup!$C$1:$C$126,0))","v":"Elementary School"},"Nat_Gas","EMERYES","Katy, TX",98438,44044,341.96,279.13,-18.3734939759036,1670.67,1322.96,-20.812608115307,0,0,0]
[{"$f":"INDEX(Lookup!$A$1:$A$126,MATCH(DataYY03!C322,Lookup!$C$1:$C$126,0))","v":"Elementary School"},"Nat_Gas","EMMOTTES","Houston, TX",77394,43952,444.96,245.14,-44.907407407407398,2034.14,1216.22,-40.209621756614602,0,0,0]
[{"$f":"INDEX(Lookup!$A$1:$A$126,MATCH(DataYY03!C323,Lookup!$C$1:$C$126,0))","v":"Administration"},"Nat_Gas","EXHIBITCENTERSCIENCERESOURCEC","Cypress, TX",72198,367,1105.19,988.8,-10.531220876048501,4446.17,3623.03,-18.513462148320901,0,0,0]
[{"$f":"INDEX(Lookup!$A$1:$A$126,MATCH(DataYY03!C324,Lookup!$C$1:$C$126,0))","v":"Administration"},"Nat_Gas","FALCONCOMPLEX","Houston, TX",0,367,299.73,603.58000000000004,101.37457044673501,1495.81,2329.35,55.724991810457198,0,0,0]
[{"$f":"INDEX(Lookup!$A$1:$A$126,MATCH(DataYY03!C325,Lookup!$C$1:$C$126,0))","v":"Elementary School"},"Nat_Gas","FARNEYES","Cypress, TX",95036,367,1035.1500000000001,1396.68,34.925373134328403,4560.0600000000004,5757.94,26.268952601500899,0,0,0]
[{"$f":"INDEX(Lookup!$A$1:$A$126,MATCH(DataYY03!C326,Lookup!$C$1:$C$126,0))","v":"Elementary School"},"Nat_Gas","FIESTES","Houston, TX",91621,367,342.99,300.76,-12.312312312312301,1639.16,1378.02,-15.9313306815686,0,0,0]
[{"$f":"INDEX(Lookup!$A$1:$A$126,MATCH(DataYY03!C327,Lookup!$C$1:$C$126,0))","v":"Administration"},"Nat_Gas","FOODPRODUCTIONCENTER","Houston, TX",57684,367,14298.46,14266.53,-0.22331076213802001,55023.75,49667.14,-9.7350871214702703,0,0,0]
[{"$f":"INDEX(Lookup!$A$1:$A$126,MATCH(DataYY03!C328,Lookup!$C$1:$C$126,0))","v":"Administration"},"Nat_Gas","FOODSERVICEWAREHOUSE","Houston, TX",48487,43952,510.88,596.37,16.7338709677419,2095.5300000000002,2150.2199999999998,2.6098409471589501,0,0,0]
[{"$f":"INDEX(Lookup!$A$1:$A$126,MATCH(DataYY03!C329,Lookup!$C$1:$C$126,0))","v":"Elementary School"},"Nat_Gas","FRANCONEES","Houston, TX",90518,367,467.62,444.96,-4.8458149779735704,2077.7199999999998,1811.59,-12.808751901122401,0,0,0]
[{"$f":"INDEX(Lookup!$A$1:$A$126,MATCH(DataYY03!C330,Lookup!$C$1:$C$126,0))","v":"Elementary School"},"Nat_Gas","GLEASONES","Houston, TX",91424,367,944.51,752.93,-20.283533260632499,3791.89,2858.96,-24.603298091453102,0,0,0]
[{"$f":"INDEX(Lookup!$A$1:$A$126,MATCH(DataYY03!C331,Lookup!$C$1:$C$126,0))","v":"Middle School"},"Nat_Gas","GOODSONMS","Cypress, TX",218801,367,2507.02,2652.25,5.7929334428923598,9310.5,8984.76,-3.4986305783792502,0,0,0]
[{"$f":"INDEX(Lookup!$A$1:$A$126,MATCH(DataYY03!C332,Lookup!$C$1:$C$126,0))","v":"Elementary School"},"Nat_Gas","HAIRGROVEES","Houston, TX",85052,367,376.98,351.23,-6.8306010928961696,1789.21,1558.86,-12.874397080275701,0,0,0]
[{"$f":"INDEX(Lookup!$A$1:$A$126,MATCH(DataYY03!C333,Lookup!$C$1:$C$126,0))","v":"Elementary School"},"Nat_Gas","HAMILTONES","Cypress, TX",89692,44044,407.88,307.97000000000003,-24.494949494949498,1905.39,1421.26,-25.408446564745301,0,0,0]
[{"$f":"INDEX(Lookup!$A$1:$A$126,MATCH(DataYY03!C334,Lookup!$C$1:$C$126,0))","v":"Middle School"},"Nat_Gas","HAMILTONMS","Cypress, TX",194726,44044,1606.8,1998.2,24.3589743589744,6527.97,7149.12,9.51520916915978,0,0,0]
[{"$f":"INDEX(Lookup!$A$1:$A$126,MATCH(DataYY03!C335,Lookup!$C$1:$C$126,0))","v":"Elementary School"},"Nat_Gas","HANCOCKES","Houston, TX",88795,367,921.85,895.07,-2.9050279329608899,3692.68,3278.24,-11.223284985430601,0,0,0]
[{"$f":"INDEX(Lookup!$A$1:$A$126,MATCH(DataYY03!C336,Lookup!$C$1:$C$126,0))","v":"Elementary School"},"Nat_Gas","HEMMENWAYES","Katy, TX",101091,44044,715.85,726.15,1.43884892086331,2982.75,2652.78,-11.0626100075434,0,0,0]
[{"$f":"INDEX(Lookup!$A$1:$A$126,MATCH(DataYY03!C337,Lookup!$C$1:$C$126,0))","v":"Elementary School"},"Nat_Gas","HOLBROOKES","Houston, TX",99937,367,691.13,725.12,4.9180327868852496,3156.64,2918.81,-7.5342769527092104,0,0,0]
[{"$f":"INDEX(Lookup!$A$1:$A$126,MATCH(DataYY03!C338,Lookup!$C$1:$C$126,0))","v":"Elementary School"},"Nat_Gas","HOLMSLEYES","Houston, TX",81704,44044,736.45,681.86,-7.4125874125874098,2940.54,2494.69,-15.162181095989199,0,0,0]
[{"$f":"INDEX(Lookup!$A$1:$A$126,MATCH(DataYY03!C339,Lookup!$C$1:$C$126,0))","v":"Elementary School"},"Nat_Gas","HOOVERES","Katy, TX",112519,367,675.68,1011.46,49.695121951219498,2855.43,3731.43,30.678391695821599,0,0,0]
[{"$f":"INDEX(Lookup!$A$1:$A$126,MATCH(DataYY03!C340,Lookup!$C$1:$C$126,0))","v":"Middle School"},"Nat_Gas","HOPPERMS","Cypress, TX",226178,367,2088.84,2856.19,36.7357001972387,8692.0499999999993,10314.049999999999,18.660730207488498,0,0,0]
[{"$f":"INDEX(Lookup!$A$1:$A$126,MATCH(DataYY03!C341,Lookup!$C$1:$C$126,0))","v":"Elementary School"},"Nat_Gas","HORNEES","Houston, TX",87881,367,555.16999999999996,513.97,-7.4211502782931396,2448.4299999999998,2076.19,-15.2032118541269,0,0,0]
[{"$f":"INDEX(Lookup!$A$1:$A$126,MATCH(DataYY03!C342,Lookup!$C$1:$C$126,0))","v":"Administration"},"Nat_Gas","ISCA","Houston, TX",132467,367,674.65,526.33000000000004,-21.9847328244275,3056.6,2287.35,-25.166852057842,0,0,0]
[{"$f":"INDEX(Lookup!$A$1:$A$126,MATCH(DataYY03!C343,Lookup!$C$1:$C$126,0))","v":"Administration"},"Nat_Gas","ISCW","Houston, TX",35364,367,295.61,218.36,-26.1324041811847,1515.34,1496.61,-1.2360262383359499,0,0,0]
[{"$f":"INDEX(Lookup!$A$1:$A$126,MATCH(DataYY03!C344,Lookup!$C$1:$C$126,0))","v":"High School"},"Nat_Gas","JERSEYVILLAGEHS","Houston, TX",513473,43952,2921.08,3717.27,27.256699576868801,11331.12,12796.9,12.9358792422991,0,0,0]
[{"$f":"INDEX(Lookup!$A$1:$A$126,MATCH(DataYY03!C345,Lookup!$C$1:$C$126,0))","v":"Elementary School"},"Nat_Gas","JOWELLES","Katy, TX",73726,367,335.78,355.35,5.8282208588957101,1650.74,1554.23,-5.84646885639168,0,0,0]
[{"$f":"INDEX(Lookup!$A$1:$A$126,MATCH(DataYY03!C346,Lookup!$C$1:$C$126,0))","v":"Middle School"},"Nat_Gas","KAHLAMS","Houston, TX",221601,367,2637.83,2487.4499999999998,-5.70089808668489,10853.24,9400.31,-13.387062296604499,0,0,0]
[{"$f":"INDEX(Lookup!$A$1:$A$126,MATCH(DataYY03!C347,Lookup!$C$1:$C$126,0))","v":"Elementary School"},"Nat_Gas","KEITHES","Cypress, TX",95518,367,551.04999999999995,515,-6.5420560747663501,2641.85,2274.81,-13.893294471677001,0,0,0]
[{"$f":"INDEX(Lookup!$A$1:$A$126,MATCH(DataYY03!C348,Lookup!$C$1:$C$126,0))","v":"Elementary School"},"Nat_Gas","KIRKES","Houston, TX",93897,367,596.37,546.92999999999995,-8.2901554404145106,2742.09,2358.61,-13.984953083232099,0,0,0]
[{"$f":"INDEX(Lookup!$A$1:$A$126,MATCH(DataYY03!C349,Lookup!$C$1:$C$126,0))","v":"Middle School"},"Nat_Gas","LABAYMS","Houston, TX",190510,43952,1414.19,1560.45,10.3423160961398,5648.44,5759.34,1.9633739581194101,0,0,0]
[{"$f":"INDEX(Lookup!$A$1:$A$126,MATCH(DataYY03!C350,Lookup!$C$1:$C$126,0))","v":"Elementary School"},"Nat_Gas","LAMKINES","Cypress, TX",113622,43956,663.32,557.23,-15.9937888198758,2821.78,2189.33,-22.413157652262001,0,0,0]
[{"$f":"INDEX(Lookup!$A$1:$A$126,MATCH(DataYY03!C351,Lookup!$C$1:$C$126,0))","v":"High School"},"Nat_Gas","LANGHAMCREEKHS","Houston, TX",535686,367,3979.92,3867.65,-2.82091097308489,14200.82,12894.98,-9.1955253288190395,0,0,0]
[{"$f":"INDEX(Lookup!$A$1:$A$126,MATCH(DataYY03!C352,Lookup!$C$1:$C$126,0))","v":"Administration"},"Nat_Gas","LANGHAMCREEKRETENTIONPOND","Houston, TX",0,367,29.87,28.84,-3.4482758620689702,367.33,360.85,-1.76408134375085,0,0,0]
[{"$f":"INDEX(Lookup!$A$1:$A$126,MATCH(DataYY03!C353,Lookup!$C$1:$C$126,0))","v":"Elementary School"},"Nat_Gas","LEEES","Houston, TX",95352,367,1220.55,1654.18,35.527426160337598,5030.32,5707.2,13.456002799026701,0,0,0]
[{"$f":"INDEX(Lookup!$A$1:$A$126,MATCH(DataYY03!C354,Lookup!$C$1:$C$126,0))","v":"Elementary School"},"Nat_Gas","LIEDERES","Houston, TX",88406,367,733.36,599.46,-18.258426966292099,3228.37,2510.3000000000002,-22.2424938901055,0,0,0]
[{"$f":"INDEX(Lookup!$A$1:$A$126,MATCH(DataYY03!C355,Lookup!$C$1:$C$126,0))","v":"Elementary School"},"Nat_Gas","LOWERYES","Houston, TX",78614,43956,1.03,63.86,6100,278.02999999999997,481.18,73.067654569650799,0,0,0]
[{"$f":"INDEX(Lookup!$A$1:$A$126,MATCH(DataYY03!C356,Lookup!$C$1:$C$126,0))","v":"Administration"},"Nat_Gas","MAINTENANCEOPER","Houston, TX",36679,43952,361.53,476.89,31.9088319088319,1804.86,1923.67,6.5827820440366596,0,0,0]
[{"$f":"INDEX(Lookup!$A$1:$A$126,MATCH(DataYY03!C357,Lookup!$C$1:$C$126,0))","v":"Elementary School"},"Nat_Gas","MATZKEMILLSES","Houston, TX",124682,367,955.84,938.33,-1.8318965517241399,3938.02,3744.1,-4.9243020604263101,0,0,0]
[{"$f":"INDEX(Lookup!$A$1:$A$126,MATCH(DataYY03!C358,Lookup!$C$1:$C$126,0))","v":"Elementary School"},"Nat_Gas","MCFEEES","Katy, TX",105539,367,910.52,599.46,-34.162895927601802,3890.47,2491.58,-35.956838119815899,0,0,0]
[{"$f":"INDEX(Lookup!$A$1:$A$126,MATCH(DataYY03!C359,Lookup!$C$1:$C$126,0))","v":"Elementary School"},"Nat_Gas","METCALFES","Houston, TX",85120,43956,273.98,433.63,58.2706766917293,1415.12,1816,28.3283396461078,0,0,0]
[{"$f":"INDEX(Lookup!$A$1:$A$126,MATCH(DataYY03!C360,Lookup!$C$1:$C$126,0))","v":"Elementary School"},"Nat_Gas","MILLSAPES","Cypress, TX",77324,367,529.41999999999996,340.93,-35.603112840466899,2347.11,1517.55,-35.3438909978655,0,0,0]
[{"$f":"INDEX(Lookup!$A$1:$A$126,MATCH(DataYY03!C361,Lookup!$C$1:$C$126,0))","v":"Elementary School"},"Nat_Gas","MOOREES","Houston, TX",83063,43952,520.15,479.98,-7.7227722772277199,2245.42,1952.43,-13.0483383954895,0,0,0]
[{"$f":"INDEX(Lookup!$A$1:$A$126,MATCH(DataYY03!C362,Lookup!$C$1:$C$126,0))","v":"Elementary School"},"Nat_Gas","OWENSES","Houston, TX",85590,43952,728.21,630.36,-13.437057991513401,2992.93,2355.29,-21.304875155783801,0,0,0]
[{"$f":"INDEX(Lookup!$A$1:$A$126,MATCH(DataYY03!C363,Lookup!$C$1:$C$126,0))","v":"Elementary School"},"Nat_Gas","POPEES","Cypress, TX",112970,367,603.58000000000004,582.98,-3.4129692832764502,2610.58,2266.12,-13.1947689785412,0,0,0]
[{"$f":"INDEX(Lookup!$A$1:$A$126,MATCH(DataYY03!C364,Lookup!$C$1:$C$126,0))","v":"Elementary School"},"Nat_Gas","POSTES","Houston, TX",104852,367,625.21,1242.18,98.682042833607895,2823.28,4572.13,61.943909211980397,0,0,0]
[{"$f":"INDEX(Lookup!$A$1:$A$126,MATCH(DataYY03!C365,Lookup!$C$1:$C$126,0))","v":"Elementary School"},"Nat_Gas","POSTMAES","Cypress, TX",98920,367,632.41999999999996,613.88,-2.9315960912052099,2714.38,2389.3000000000002,-11.9762155630383,0,0,0]
[{"$f":"INDEX(Lookup!$A$1:$A$126,MATCH(DataYY03!C366,Lookup!$C$1:$C$126,0))","v":"Administration"},"Nat_Gas","PRIDGEONSTADIUM","Houston, TX",86181,367,61.8,72.099999999999994,16.6666666666667,494.68,500.14,1.10374383439799,0,0,0]
[{"$f":"INDEX(Lookup!$A$1:$A$126,MATCH(DataYY03!C367,Lookup!$C$1:$C$126,0))","v":"Elementary School"},"Nat_Gas","REEDES","Houston, TX",90012,367,329.6,347.11,5.3125,1672.61,1541.53,-7.8368537794225803,0,0,0]
[{"$f":"INDEX(Lookup!$A$1:$A$126,MATCH(DataYY03!C368,Lookup!$C$1:$C$126,0))","v":"Elementary School"},"Nat_Gas","RENNELLES","Cypress, TX",113621,43678,599.46,413.03,-31.099656357388302,2572.2600000000002,1746.45,-32.1044528935644,0,0,0]
[{"$f":"INDEX(Lookup!$A$1:$A$126,MATCH(DataYY03!C369,Lookup!$C$1:$C$126,0))","v":"Elementary School"},"Nat_Gas","ROBINSONES","Katy, TX",98532,43956,349.17,263.68,-24.483775811209401,1714.2,1281.32,-25.252595963131501,0,0,0]
[{"$f":"INDEX(Lookup!$A$1:$A$126,MATCH(DataYY03!C370,Lookup!$C$1:$C$126,0))","v":"Elementary School"},"Nat_Gas","ROBISONES","Cypress, TX",93882,43952,471.74,523.24,10.9170305676856,2143.96,2109.21,-1.62083247821788,0,0,0]
[{"$f":"INDEX(Lookup!$A$1:$A$127,MATCH(DataYY03!C371,Lookup!$C$1:$C$127,0))","v":"Middle School"},"Nat_Gas","ROWEMS","Cypress, TX",0,367,0,198.79,0,0,1134.8699999999999,0,0,null,0]
[{"$f":"INDEX(Lookup!$A$1:$A$126,MATCH(DataYY03!C372,Lookup!$C$1:$C$126,0))","v":"Middle School"},"Nat_Gas","SALYARDSMS","Cypress, TX",242116,43952,971.29,792.07,-18.451749734888701,4266.8900000000003,3303.72,-22.5731153134953,0,0,0]
[{"$f":"INDEX(Lookup!$A$1:$A$126,MATCH(DataYY03!C373,Lookup!$C$1:$C$126,0))","v":"Elementary School"},"Nat_Gas","SAMPSONES","Cypress, TX",96096,367,447.02,475.86,6.4516129032258096,2068.83,1977.57,-4.4111889328750999,0,0,0]
[{"$f":"INDEX(Lookup!$A$1:$A$126,MATCH(DataYY03!C374,Lookup!$C$1:$C$126,0))","v":"Administration"},"Nat_Gas","SATELLITECOLDFOODWAREHOUSE","Cypress, TX",22020,367,53.56,28.84,-46.153846153846203,450.7,357.09,-20.7699134679388,0,0,0]
[{"$f":"INDEX(Lookup!$A$1:$A$126,MATCH(DataYY03!C375,Lookup!$C$1:$C$126,0))","v":"Elementary School"},"Nat_Gas","SHERIDANES","Katy, TX",92874,44044,261.62,284.27999999999997,8.6614173228346392,1400.22,1366.5,-2.40819299824313,0,0,0]
[{"$f":"INDEX(Lookup!$A$1:$A$126,MATCH(DataYY03!C376,Lookup!$C$1:$C$126,0))","v":"Middle School"},"Nat_Gas","SMITHMS","Cypress, TX",233159,44044,1159.78,901.25,-22.291296625222,5026.3900000000003,3670.25,-26.9803974621945,0,0,0]
[{"$f":"INDEX(Lookup!$A$1:$A$126,MATCH(DataYY03!C377,Lookup!$C$1:$C$126,0))","v":"Middle School"},"Nat_Gas","SPILLANEMS","Cypress, TX",235889,367,3000.39,3529.81,17.645039478201198,12768.15,13076.95,2.4185179528749301,0,0,0]
[{"$f":"INDEX(Lookup!$A$1:$A$126,MATCH(DataYY03!C378,Lookup!$C$1:$C$126,0))","v":"Elementary School"},"Nat_Gas","SWENKEES","Cypress, TX",107914,367,417.15,487.19,16.790123456790099,2136.96,2149.96,0.60834082060497197,0,0,0]
[{"$f":"INDEX(Lookup!$A$1:$A$126,MATCH(DataYY03!C379,Lookup!$C$1:$C$126,0))","v":"Administration"},"Nat_Gas","TELGETRANS","Cypress, TX",19649,367,297.67,248.23,-16.6089965397924,1533.93,1237.04,-19.354859739362301,0,0,0]
[{"$f":"INDEX(Lookup!$A$1:$A$126,MATCH(DataYY03!C380,Lookup!$C$1:$C$126,0))","v":"Middle School"},"Nat_Gas","THORNTONMS","Katy, TX",202739,44044,1361.66,1965.24,44.326777609682303,5909.1,7136.68,20.7743988086172,0,0,0]
[{"$f":"INDEX(Lookup!$A$1:$A$126,MATCH(DataYY03!C381,Lookup!$C$1:$C$126,0))","v":"Elementary School"},"Nat_Gas","TIPPSES","Houston, TX",101727,367,593.28,547.96,-7.6388888888888902,2792.13,2355.46,-15.6393147883515,0,0,0]
[{"$f":"INDEX(Lookup!$A$1:$A$126,MATCH(DataYY03!C382,Lookup!$C$1:$C$126,0))","v":"Middle School"},"Nat_Gas","TRUITTMS","Houston, TX",209274,43952,1241.1500000000001,2171.2399999999998,74.937759336099603,5118.66,7426.05,45.0780086975888,0,0,0]
[{"$f":"INDEX(Lookup!$A$1:$A$126,MATCH(DataYY03!C383,Lookup!$C$1:$C$126,0))","v":"Elementary School"},"Nat_Gas","WALKERES","Katy, TX",98321,367,445.99,672.59,50.808314087759797,1994.6,2586.3000000000002,29.665095758548102,0,0,0]
[{"$f":"INDEX(Lookup!$A$1:$A$126,MATCH(DataYY03!C384,Lookup!$C$1:$C$126,0))","v":"Elementary School"},"Nat_Gas","WARNERES","Cypress, TX",98451,44044,468.65,484.1,3.2967032967033001,2097.44,1963.71,-6.3758677244641104,0,0,0]
[{"$f":"INDEX(Lookup!$A$1:$A$126,MATCH(DataYY03!C385,Lookup!$C$1:$C$126,0))","v":"Middle School"},"Nat_Gas","WATKINSMS","Houston, TX",220237,44044,2722.29,3745.08,37.570942111237201,10109.74,12219.21,20.865719593184402,0,0,0]
[{"$f":"INDEX(Lookup!$A$1:$A$126,MATCH(DataYY03!C386,Lookup!$C$1:$C$126,0))","v":"Elementary School"},"Nat_Gas","WELLSES","Cypress, TX",122878,367,5272.57,7449.99,41.297128345380003,17413.63,23373.47,34.225144326599299,0,0,0]
[{"$f":"INDEX(Lookup!$A$1:$A$126,MATCH(DataYY03!C387,Lookup!$C$1:$C$126,0))","v":"Administration"},"Nat_Gas","WESTGREENTRANS","Cypress, TX",45340,367,1052.6600000000001,882.71,-16.144814090019601,4084.19,3008.07,-26.348431390312399,0,0,0]
[{"$f":"INDEX(Lookup!$A$1:$A$126,MATCH(DataYY03!C388,Lookup!$C$1:$C$126,0))","v":"Elementary School"},"Nat_Gas","WILLBERNES","Houston, TX",89993,367,342.99,435.69,27.027027027027,1691.22,1802.62,6.5869608921370402,0,0,0]
[{"$f":"INDEX(Lookup!$A$1:$A$126,MATCH(DataYY03!C389,Lookup!$C$1:$C$126,0))","v":"Elementary School"},"Nat_Gas","WILSONES","Houston, TX",84992,367,492.34,572.67999999999995,16.317991631799199,2148.58,2193.66,2.0981299276731602,0,0,0]
[{"$f":"INDEX(Lookup!$A$1:$A$126,MATCH(DataYY03!C390,Lookup!$C$1:$C$126,0))","v":"Special School"},"Nat_Gas","WINDFERNANNEX","Houston, TX",59400,43952,3103.39,2330.89,-24.8921340856289,13588.43,9424.3700000000008,-30.644158302320399,0,0,0]
[{"$f":"INDEX(Lookup!$A$1:$A$126,MATCH(DataYY03!C391,Lookup!$C$1:$C$126,0))","v":"Special School"},"Nat_Gas","WINDFERNHS","Houston, TX",50022,367,170.98,196.73,15.060240963855399,869.41,880.18,1.23877112064504,0,0,0]
[{"$f":"INDEX(Lookup!$A$1:$A$126,MATCH(DataYY03!C392,Lookup!$C$1:$C$126,0))","v":"Elementary School"},"Nat_Gas","WOODARDES","Cypress, TX",116974,44044,345.05,315.18,-8.6567164179104505,1664.03,1439.98,-13.464300523428101,0,0,0]
[{"$f":"INDEX(Lookup!$A$1:$A$126,MATCH(DataYY03!C393,Lookup!$C$1:$C$126,0))","v":"Elementary School"},"Nat_Gas","YEAGERES","Houston, TX",81794,"1901-01-01",1032.06,828.12,-19.760479041916199,4263.1499999999996,3212.19,-24.652193800358901,0,0,0]
[{"$f":"INDEX(Lookup!$A$1:$A$126,MATCH(DataYY03!C394,Lookup!$C$1:$C$126,0))","v":"Middle School"},"Fire","ANTHONYMS","Cypress, TX",244123,"1901-01-01",0,0,0,307.64999999999998,303.95999999999998,-1.1994149195514401,0,0,0]
[{"$f":"INDEX(Lookup!$A$1:$A$126,MATCH(DataYY03!C395,Lookup!$C$1:$C$126,0))","v":"Administration"},"Fire","BERRYCENTER","Cypress, TX",491434,"1901-01-01",0,0,0,3510.81,3434.4,-2.1764208259632398,0,0,0]
[{"$f":"INDEX(Lookup!$A$1:$A$126,MATCH(DataYY03!C396,Lookup!$C$1:$C$126,0))","v":"Middle School"},"Fire","BLEYLMS","Houston, TX",229363,"1901-01-01",0,0,0,9222.7199999999993,9237.44,0.159605842961729,0,0,0]
[{"$f":"INDEX(Lookup!$A$1:$A$126,MATCH(DataYY03!C397,Lookup!$C$1:$C$126,0))","v":"High School"},"Fire","CY-LAKESHS","Katy, TX",514068,"2020-05-01",0,0,0,927.4,920.82,-0.70951045934871704,0,0,0]
[{"$f":"INDEX(Lookup!$A$1:$A$126,MATCH(DataYY03!C398,Lookup!$C$1:$C$126,0))","v":"High School"},"Fire","CY-WOODSHS","Cypress, TX",535914,"1901-01-01",0,0,0,600,600,0,0,0,0]
[{"$f":"INDEX(Lookup!$A$1:$A$126,MATCH(DataYY03!C399,Lookup!$C$1:$C$126,0))","v":"Middle School"},"Fire","DEANMS","Houston, TX",222788,"2020-08-01",0,0,0,1175.25,1214.3699999999999,3.3286534779834098,0,0,0]
[{"$f":"INDEX(Lookup!$A$1:$A$126,MATCH(DataYY03!C400,Lookup!$C$1:$C$126,0))","v":"Elementary School"},"Fire","EMERYES","Katy, TX",98438,"2020-08-01",0,0,0,660,660,0,0,0,0]
[{"$f":"INDEX(Lookup!$A$1:$A$126,MATCH(DataYY03!C401,Lookup!$C$1:$C$126,0))","v":"Elementary School"},"Fire","EMMOTTES","Houston, TX",77394,"2020-05-01",0,0,0,378.7,1107.7,192.50066015315599,0,0,0]
[{"$f":"INDEX(Lookup!$A$1:$A$126,MATCH(DataYY03!C402,Lookup!$C$1:$C$126,0))","v":"Elementary School"},"Fire","FARNEYES","Cypress, TX",95036,"1901-01-01",0,0,0,348.8,300,-13.9908256880734,0,0,0]
[{"$f":"INDEX(Lookup!$A$1:$A$126,MATCH(DataYY03!C403,Lookup!$C$1:$C$126,0))","v":"Elementary School"},"Fire","FRAZIERES","Houston, TX",85844,"1901-01-01",0,null,0,0,180,0,0,null,0]
[{"$f":"INDEX(Lookup!$A$1:$A$126,MATCH(DataYY03!C404,Lookup!$C$1:$C$126,0))","v":"Middle School"},"Fire","GOODSONMS","Cypress, TX",218801,"1901-01-01",0,0,0,300,300,0,0,0,0]
[{"$f":"INDEX(Lookup!$A$1:$A$126,MATCH(DataYY03!C405,Lookup!$C$1:$C$126,0))","v":"Elementary School"},"Fire","HEMMENWAYES","Katy, TX",101091,"2020-08-01",0,0,0,241,292.76,21.477178423236499,0,0,0]
[{"$f":"INDEX(Lookup!$A$1:$A$126,MATCH(DataYY03!C406,Lookup!$C$1:$C$126,0))","v":"Elementary School"},"Fire","LOWERYES","Houston, TX",78614,"2020-05-05",0,null,0,0,0,0,0,null,0]
[{"$f":"INDEX(Lookup!$A$1:$A$126,MATCH(DataYY03!C407,Lookup!$C$1:$C$126,0))","v":"Elementary School"},"Fire","METCALFES","Houston, TX",85120,"2020-05-05",0,0,0,1939.38,1932,-0.380533985088018,0,0,0]
[{"$f":"INDEX(Lookup!$A$1:$A$126,MATCH(DataYY03!C408,Lookup!$C$1:$C$126,0))","v":"Elementary School"},"Fire","MOOREES","Houston, TX",83063,"2020-05-01",0,0,0,192,196.25,2.2135416666666701,0,0,0]
[{"$f":"INDEX(Lookup!$A$1:$A$126,MATCH(DataYY03!C409,Lookup!$C$1:$C$126,0))","v":"Elementary School"},"Fire","POSTMAES","Cypress, TX",98920,"1901-01-01",null,0,null,96.52,0,-100,null,0]
[{"$f":"INDEX(Lookup!$A$1:$A$126,MATCH(DataYY03!C410,Lookup!$C$1:$C$126,0))","v":"Elementary School"},"Fire","RENNELLES","Cypress, TX",113621,"2019-08-01",0,0,0,300,300,0,0,0,0]
[{"$f":"INDEX(Lookup!$A$1:$A$126,MATCH(DataYY03!C411,Lookup!$C$1:$C$126,0))","v":"Elementary School"},"Fire","ROBINSONES","Katy, TX",98532,"2020-05-05",0,0,0,288,288,0,0,0,0]
[{"$f":"INDEX(Lookup!$A$1:$A$126,MATCH(DataYY03!C412,Lookup!$C$1:$C$126,0))","v":"Elementary School"},"Fire","ROBISONES","Cypress, TX",93882,"2020-05-01",0,0,0,300,300,0,0,0,0]
[{"$f":"INDEX(Lookup!$A$1:$A$126,MATCH(DataYY03!C413,Lookup!$C$1:$C$126,0))","v":"Administration"},"Fire","SATELLITECOLDFOODWAREHOUSE","Cypress, TX",22020,"1901-01-01",0,0,0,300,300,0,0,0,0]
["Special School","Fire","SMITHMS","Cypress, TX",233159,44044,0,0,0,180,747.96,315.53333333333302,0,0,0]
["Special School","Fire","TRUITTMS","Houston, TX",209274,43952,0,0,0,806.28,487.28,-39.564419308428803,0,0,0]
["Special School","Fire","WARNERES","Cypress, TX",98451,44044,0,0,0,192.81,180,-6.64384627353353,0,0,0]
["Special School","Fire","YEAGERES","Houston, TX",81794,367,0,null,0,0,60,0,0,null,0]
[{"$f":"INDEX(Lookup!$A$1:$A$126,MATCH(DataYY03!C418,Lookup!$C$1:$C$126,0))","v":"High School"},"Electric","CY-PARKHS","Cypress, TX",174674]

{"sheet":"Avg. Costs","index":4,"n_rows":9,"n_cols":6,"rows_kept":9,"cut":false,"hidden":false,"merged":[]}
["Utility","(All)",null,null,"Utility","(All)"]
[]
["Row Labels","Sum of Cost","Cost/SF",null,"Row Labels","Average of Area"]
["Administration",2427868.36,{"$f":"B4/F4","v":66.19206155765697},null,"Administration",36679.147058823532]
["Elementary School",4840936.2800000021,{"$f":"B5/F5","v":50.530667282520561},null,"Elementary School",95801.946428571435]
["High School",5670347.2200000025,93.812512532385711,null,"Special School",60443.4]
["Middle School",3324811.61,15.119178970695678,null,"Middle School",219906.88888888888]
["Special School",309680.71999999997,0.56746263177713707,null,"High School",545728.83333333337]
["Grand Total",16573644.190000005,null,null,"Grand Total",139370.296]

{"sheet":"Dashboard $","index":5,"n_rows":52,"n_cols":51,"rows_kept":52,"cut":false,"hidden":false,"merged":[[3,0,3,15],[15,8,15,9],[21,7,21,9],[24,0,24,2],[15,10,15,11],[14,7,14,11]]}
[]
[]
[]
["CFISD Energy Management Dept. Utilities (CY 2020)"]
[]
["School Type Sorted ","UTILITY COSTS","%","SQU FT","COST/ ft2"]
[{"$f":"INDEX($AR$10:$AR$14,MATCH(AX10,$AW$10:$AW$14,0))","v":"High School"},{"$f":"INDEX($AS$10:$AS$14,MATCH(AX10,$AW$10:$AW$14,0))","v":5670347.2200000025},{"$f":"B7/$B$12","v":0.34213038605149249},{"$f":"INDEX($AV$10:$AV$14,MATCH(A7,$AU$10:$AU$14,0))","v":6548746},{"$f":"B7/D7","v":0.8658676363383162},null,null,null,null,null,null,null,null,null,null,null,null,null,null,null,null,null,null,null,null,null,null,null,null,null,null,null,null,null,null,null,null,null,null,null,null,null,null,"Utility","(All)",null,"Utility","(All)"]
[{"$f":"INDEX($AR$10:$AR$14,MATCH(AX11,$AW$10:$AW$14,0))","v":"Elementary School"},{"$f":"INDEX($AS$10:$AS$14,MATCH(AX11,$AW$10:$AW$14,0))","v":4840936.2800000021},{"$f":"B8/$B$12","v":0.29208641624014625},{"$f":"INDEX($AV$10:$AV$14,MATCH(A8,$AU$10:$AU$14,0))","v":5364909},{"$f":"B8/D8","v":0.90233334433072432},null,null,null,null,null,null,null,null,null,null,null,null,null,null,null,null,null,null,null,null,null,null,null,null,null,null,null,null,null,null,null,null,null,"Matt"]
[{"$f":"INDEX($AR$10:$AR$14,MATCH(AX12,$AW$10:$AW$14,0))","v":"Middle School"},{"$f":"INDEX($AS$10:$AS$14,MATCH(AX12,$AW$10:$AW$14,0))","v":3324811.61},{"$f":"B9/$B$12","v":0.20060836409904786},{"$f":"INDEX($AV$10:$AV$14,MATCH(A9,$AU$10:$AU$14,0))","v":3958324},0.83995438726087102,null,null,null,null,null,null,null,null,null,null,null,null,null,null,null,null,null,null,null,null,null,null,null,null,null,null,null,null,null,null,null,null,null,{"$f":"AV10/12","v":103924.25},{"$f":"#REF!","v":{"$error":"#REF!"}},{"$f":"AS10/12","v":202322.36333333331},null,null,"Row Labels","Sum of Cost",null,"Row Labels","Sum of Area"]
[{"$f":"INDEX($AR$10:$AR$14,MATCH(AX13,$AW$10:$AW$14,0))","v":"Administration"},{"$f":"INDEX($AS$10:$AS$14,MATCH(AX13,$AW$10:$AW$14,0))","v":2427868.36},{"$f":"B10/$B$12","v":0.14648971342693254},{"$f":"INDEX($AV$10:$AV$14,MATCH(A10,$AU$10:$AU$14,0))","v":1247091},1.9468253399310875,null,null,null,null,null,null,null,null,null,null,null,null,null,null,null,null,null,null,null,null,null,null,null,null,null,null,null,null,null,null,null,null,null,{"$f":"AV11/18","v":298050.5},{"$f":"#REF!","v":{"$error":"#REF!"}},{"$f":"AS11/18","v":268940.90444444458},null,null,"Administration",2427868.36,null,"Administration",1247091,{"$f":"RANK(AS10,$AS$10:$AS$14,0)","v":4},1,{"$f":"AV10","v":1247091}]
[{"$f":"INDEX($AR$10:$AR$14,MATCH(AX14,$AW$10:$AW$14,0))","v":"Special School"},{"$f":"INDEX($AS$10:$AS$14,MATCH(AX14,$AW$10:$AW$14,0))","v":309680.71999999997},{"$f":"B11/$B$12","v":1.8685131646365757E-2},{"$f":"INDEX($AV$10:$AV$14,MATCH(A11,$AU$10:$AU$14,0))","v":302217},1.0246965590949548,null,null,null,null,null,null,null,null,null,null,null,null,null,null,null,null,null,null,null,null,null,null,null,null,null,null,null,null,null,null,null,null,null,{"$f":"AV12/56","v":5396.7321428571431},{"$f":"#REF!","v":{"$error":"#REF!"}},{"$f":"AS12/56","v":5530.0128571428568},null,null,"Elementary School",4840936.2800000021,null,"Elementary School",5364909,{"$f":"RANK(AS11,$AS$10:$AS$14,0)","v":2},2,{"$f":"AV11","v":5364909}]
[{"$f":"\"% Expenses ( \"&ROUND(B12/AN23*100,1)&\"%)\"","v":"% Expenses ( 100%)"},{"$f":"ROUND(SUM(B7:B11),0)","v":16573644},null,{"$f":"IFERROR(SUM(D7:D11),\"\")","v":17421287},"Total Squ Ft.",null,null,null,null,null,null,null,null,null,null,null,null,null,null,null,null,null,null,null,null,null,null,null,null,null,null,null,null,null,null,null,null,null,{"$f":"AV13/4","v":989581},{"$f":"#REF!","v":{"$error":"#REF!"}},{"$f":"AS13/4","v":831202.90249999997},null,null,"Special School",309680.71999999997,null,"Special School",302217,{"$f":"RANK(AS12,$AS$10:$AS$14,0)","v":5},3,{"$f":"AV12","v":302217}]
[null,null,null,null,null,null,null,null,null,null,null,null,null,null,null,null,null,null,null,null,null,null,null,null,null,null,null,null,null,null,null,null,null,null,null,null,null,null,null,null,null,null,null,"Middle School",3324811.61,null,"Middle School",3958324,{"$f":"RANK(AS13,$AS$10:$AS$14,0)","v":3},4,{"$f":"AV13","v":3958324}]
[null,null,null,null,null,null,null,null,null,null,null,null,null,null,null,null,null,null,null,null,null,null,null,null,null,null,null,null,null,null,null,null,null,null,null,null,null,null,null,null,null,null,null,"High School",5670347.2200000025,null,"High School",6548746,{"$f":"RANK(AS14,$AS$10:$AS$14,0)","v":1},5,{"$f":"AV14","v":6548746}]
[null,null,null,null,"Costs per Squ. ft.",null,null,"Consumption",null,null,null,null,null,null,null,null,null,null,null,null,null,null,null,null,null,null,null,null,null,null,null,null,null,null,null,null,null,null,null,null,null,null,null,"Grand Total",16573644.190000005,null,"Grand Total",17421287,null,null,{"$f":"SUM(AY10:AY14)","v":17421287}]
[null,null,null,null,"Total",{"$f":"B12/D12","v":0.95134440985904201},null,"Utility","Annual Usage",null,"Blended Rate"]
[null,null,null,null,"Schools Only",{"$f":"SUM(AS11,AS13,AS14)/SUM(AV11,AV13,AV14)","v":0.87173093600993334},null,"Electric",{"$f":"Benchmark!F13","v":172614128},"kWhs",{"$f":"AS29/I17","v":7.1876193297457092E-2},"Per kWh",null,null,null,null,null,null,null,null,null,null,null,null,null,null,null,null,null,null,null,null,null,null,null,null,null,null,"Utility","Costs"]
[null,null,null,null,null,null,null,"Water",{"$f":"water!B26*1000","v":445432000},"Gallons",{"$f":"AS40/(I18/1000)","v":7.8027869124804674},"Per kGal",null,null,null,null,null,null,null,null,null,null,null,null,null,null,null,null,null,null,null,null,null,null,null,null,null,null,"Electric",12406846.430000003]
[null,null,null,null,null,null,null,"Natural Gas",{"$f":"Benchmark!F47*10","v":1911309.1999999981},"Therms",{"$f":"AS52/I19","v":0.36163001779094694},"Per Therm",null,null,null,null,null,null,null,null,null,null,null,null,null,null,null,null,null,null,null,null,null,null,null,null,null,null,"Fire",23342.94]
[null,null,null,null,null,null,null,null,null,null,null,null,null,null,null,null,null,null,null,null,null,null,null,null,null,null,null,null,null,null,null,null,null,null,null,null,null,null,"Irrigation",748082.26000000013,null,null,null,"Electric Only"]
[null,null,null,null,null,null,null,null,null,null,null,null,null,null,null,null,null,null,null,null,null,null,null,null,null,null,null,null,null,null,null,null,null,null,null,null,null,null,"Nat_Gas",691186.7799999998,null,null,null,"Utility","Electric",null,"Utility","(All)"]
[null,null,null,null,null,null,null,"Energy Benchmarks",null,null,null,null,null,null,null,null,null,null,null,null,null,null,null,null,null,null,null,null,null,null,null,null,null,null,null,null,null,null,"Water",2704185.78]
[null,null,null,null,null,null,null,"Benchmark","Schools Only","District",null,null,null,null,null,null,null,null,null,null,null,null,null,null,null,null,null,null,null,null,null,null,null,null,null,null,null,null,"Grand Total",16573644.190000001,null,null,null,"Row Labels","Sum of Cost",null,"Row Labels","Sum of Area"]
[null,null,null,null,null,null,null,"kWh/SF",{"$f":"Benchmark!G13","v":9.0331510953745724},{"$f":"Benchmark!G12","v":9.9101700006434665},null,null,null,null,null,null,null,null,null,null,null,null,null,null,null,null,null,null,null,null,null,null,null,null,null,null,null,null,null,null,null,null,null,"Administration",1774671.1999999997,null,"Administration",1247091,4,1]
["Prepared by Jay Bonham, Energy Manager",null,null,null,null,null,null,"kBtus/SF",{"$f":"Benchmark!F26","v":40.000730099000236},{"$f":"Benchmark!F42","v":44.777996294762829},null,null,null,null,null,null,null,null,null,null,null,null,null,null,null,null,null,null,null,null,null,null,null,null,null,null,null,null,null,null,null,null,null,"Elementary School",3794404.2500000005,null,"Elementary School",5364909,2,2]
[null,null,null,null,null,null,null,null,null,null,null,null,null,null,null,null,null,null,null,null,null,null,null,null,null,null,null,null,null,null,null,null,null,null,null,null,null,null,null,null,null,null,null,"Special School",253065.11999999997,null,"Special School",302217,5,3]
[null,null,null,null,null,null,null,null,null,null,null,null,null,null,null,null,null,null,null,null,null,null,null,null,null,null,null,null,null,null,null,null,null,null,null,null,null,null,null,null,null,null,null,"Middle School",2396168.23,null,"Middle School",3958324,3,4]
[null,null,null,null,null,null,null,null,null,null,null,null,null,null,null,null,null,null,null,null,null,null,null,null,null,null,null,null,null,null,null,null,null,null,null,null,null,null,null,null,null,null,null,"High School",4188537.63,null,"High School",6374072,1,5]
[null,null,null,null,null,null,null,null,null,null,null,null,null,null,null,null,null,null,null,null,null,null,null,null,null,null,null,null,null,null,null,null,null,null,null,null,null,null,null,null,null,null,null,"Grand Total",12406846.43,null,"Grand Total",17246613]
[]
[null,null,null,null,null,null,null,null,null,null,null,null,null,null,null,null,null,null,null,null,null,null,null,null,null,null,null,null,null,null,null,null,null,null,null,null,null,null,null,null,null,null,null,"Water"]
[null,null,null,null,null,null,null,null,null,null,null,null,null,null,null,null,null,null,null,null,null,null,null,null,null,null,null,null,null,null,null,null,null,null,null,null,null,null,null,null,null,null,null,"Utility","(Multiple Items)",null,"Utility","(All)"]
[]
[null,null,null,null,null,null,null,null,null,null,null,null,null,null,null,null,null,null,null,null,null,null,null,null,null,null,null,null,null,null,null,null,null,null,null,null,null,null,null,null,null,null,null,"Row Labels","Sum of Cost",null,"Row Labels","Sum of Area"]
[null,null,null,null,null,null,null,null,null,null,null,null,null,null,null,null,null,null,null,null,null,null,null,null,null,null,null,null,null,null,null,null,null,null,null,null,null,null,null,null,null,null,null,"Administration",513921.65,null,"Administration",1247091,4,1]
[null,null,null,null,null,null,null,null,null,null,null,null,null,null,null,null,null,null,null,null,null,null,null,null,null,null,null,null,null,null,null,null,null,null,null,null,null,null,null,null,null,null,null,"Elementary School",897897.58999999962,null,"Elementary School",5364909,2,2]
[null,null,null,null,null,null,null,null,null,null,null,null,null,null,null,null,null,null,null,null,null,null,null,null,null,null,null,null,null,null,null,null,null,null,null,null,null,null,null,null,null,null,null,"Special School",35760.58,null,"Special School",302217,5,3]
[null,null,null,null,null,null,null,null,null,null,null,null,null,null,null,null,null,null,null,null,null,null,null,null,null,null,null,null,null,null,null,null,null,null,null,null,null,null,null,null,null,null,null,"Middle School",755375.22000000009,null,"Middle School",3958324,3,4]
[null,null,null,null,null,null,null,null,null,null,null,null,null,null,null,null,null,null,null,null,null,null,null,null,null,null,null,null,null,null,null,null,null,null,null,null,null,null,null,null,null,null,null,"High School",1272655.9399999997,null,"High School",6374072,1,5]
[null,null,null,null,null,null,null,null,null,null,null,null,null,null,null,null,null,null,null,null,null,null,null,null,null,null,null,null,null,null,null,null,null,null,null,null,null,null,null,null,null,null,null,"Grand Total",3475610.9799999995,null,"Grand Total",17246613]
[]
[null,null,null,null,null,null,null,null,null,null,null,null,null,null,null,null,null,null,null,null,null,null,null,null,null,null,null,null,null,null,null,null,null,null,null,null,null,null,null,null,null,null,null,"Nat Gas"]
[null,null,null,null,null,null,null,null,null,null,null,null,null,null,null,null,null,null,null,null,null,null,null,null,null,null,null,null,null,null,null,null,null,null,null,null,null,null,null,null,null,null,null,"Utility","Nat_Gas",null,"Utility","(All)"]
[]
[null,null,null,null,null,null,null,null,null,null,null,null,null,null,null,null,null,null,null,null,null,null,null,null,null,null,null,null,null,null,null,null,null,null,null,null,null,null,null,null,null,null,null,"Row Labels","Sum of Cost",null,"Row Labels","Sum of Area"]
[null,null,null,null,null,null,null,null,null,null,null,null,null,null,null,null,null,null,null,null,null,null,null,null,null,null,null,null,null,null,null,null,null,null,null,null,null,null,null,null,null,null,null,"Administration",139275.51,null,"Administration",1247091,4,1]
[null,null,null,null,null,null,null,null,null,null,null,null,null,null,null,null,null,null,null,null,null,null,null,null,null,null,null,null,null,null,null,null,null,null,null,null,null,null,null,null,null,null,null,"Elementary School",148634.43999999997,null,"Elementary School",5364909,3,2]
[null,null,null,null,null,null,null,null,null,null,null,null,null,null,null,null,null,null,null,null,null,null,null,null,null,null,null,null,null,null,null,null,null,null,null,null,null,null,null,null,null,null,null,"Special School",20855.02,null,"Special School",302217,5,3]
[null,null,null,null,null,null,null,null,null,null,null,null,null,null,null,null,null,null,null,null,null,null,null,null,null,null,null,null,null,null,null,null,null,null,null,null,null,null,null,null,null,null,null,"Middle School",172133.28999999998,null,"Middle School",3958324,2,4]
[null,null,null,null,null,null,null,null,null,null,null,null,null,null,null,null,null,null,null,null,null,null,null,null,null,null,null,null,null,null,null,null,null,null,null,null,null,null,null,null,null,null,null,"High School",209153.65,null,"High School",6374072,1,5]
[null,null,null,null,null,null,null,null,null,null,null,null,null,null,null,null,null,null,null,null,null,null,null,null,null,null,null,null,null,null,null,null,null,null,null,null,null,null,null,null,null,null,null,"#N/A",1134.8699999999999,null,"Grand Total",17246613]
[null,null,null,null,null,null,null,null,null,null,null,null,null,null,null,null,null,null,null,null,null,null,null,null,null,null,null,null,null,null,null,null,null,null,null,null,null,null,null,null,null,null,null,"Grand Total",691186.77999999991]

{"sheet":"Benchmark","index":6,"n_rows":47,"n_cols":8,"rows_kept":47,"cut":false,"hidden":false,"merged":[]}
[]
[]
[]
[null,null,null,"Utility","Electric"]
[]
[null,null,null,"Row Labels","Sum of Area","Sum of Mmbtus","kWh/SF"]
[null,null,null,"Administration",1247091,89104.304936,{"$f":"ROUND((F7/E7*1000000)/3412,1)","v":20.9}]
[null,null,null,"Elementary School",5364909,164734.88459599996,{"$f":"ROUND((F8/E8*1000000)/3412,1)","v":9}]
[null,null,null,"High School",6548746,208058.56011200004,9.3000000000000007]
[null,null,null,"Middle School",3958324,115569.503408,8.6]
[null,null,null,"Special School",302217,11492.151684,11.1]
[null,null,null,"Grand Total",17421287,588959.404736,{"$f":"SUMPRODUCT(G7:G11,E7:E11)/SUM(E7:E11)","v":9.9101700006434665},"ALL"]
[null,null,null,null,null,{"$f":"ROUND(F12*1000/3.412,0)","v":172614128},{"$f":"SUMPRODUCT(F8:F10,G8:G10)/SUM(F8:F10)","v":9.0331510953745724},"Schools Only"]
[]
[]
[null,null,null,"Utility","(Multiple Items)"]
[]
[null,null,null,"Row Labels","Sum of Area","Sum of Mmbtus"]
[null,null,null,"Administration",2419705,128532.70493599999]
[null,null,null,"Elementary School",10643974,203409.32459599979]
[null,null,null,"High School",12415438,267989.11011199997]
[null,null,null,"Middle School",7916648,163492.31340800002]
[null,null,null,"Special School",642411,16666.871684000002]
[null,null,null,"Grand Total",34038176,780090.32473599981]
[]
[null,null,null,null,null,{"$f":"SUM(F20:F22)*1000/SUM(E8:E10)","v":40.000730099000236}]
[]
[]
[]
[null,null,null,"Utility","(Multiple Items)"]
[]
[null,null,null,"Row Labels","Sum of Area","Sum of Mmbtus"]
[null,null,null,"Administration",2419705,128532.70493599999]
[null,null,null,"Elementary School",10643974,203409.32459599979]
[null,null,null,"High School",12415438,267989.11011199997]
[null,null,null,"Middle School",7916648,163492.31340800002]
[null,null,null,"Special School",642411,16666.871684000002]
[null,null,null,"Grand Total",34038176,780090.32473599981]
[]
[null,null,null,null,null,"kBtus/SF"]
[null,null,null,null,null,"ALL"]
[null,null,null,null,null,{"$f":"F38*1000/(E12)","v":44.777996294762829}]
[]
[null,null,null,null,null,"MMBTUs"]
[null,null,null,null,"ALL",{"$f":"F38","v":780090.32473599981}]
[null,null,null,null,"Electric",{"$f":"F12","v":588959.404736}]
[null,null,null,null,"Natural Gas",{"$f":"F45-F46","v":191130.91999999981},"MMBtus Gas"]

{"sheet":"water","index":7,"n_rows":50,"n_cols":16,"rows_kept":50,"cut":false,"hidden":false,"merged":[]}
["Location:","Cypress Fairbanks ISD [Cypress Fairbanks ISD]"]
["Time:","2020-05-13T02:32:11","Commodity:","Water","Created By:","Jay Bonham",null,null,null,null,"Location:","Cypress Fairbanks ISD [Cypress Fairbanks ISD]"]
["Year","Use (KGAL)",null,null,null,null,null,null,null,null,"Time:","2020-07-08T03:36:05","Commodity:","Water","Created By:","Jay Bonham"]
[2018,332391,null,null,null,null,null,null,null,null,"Month","Previous 12 Months (KGAL)","Current 12 Months (KGAL)"]
[2019,338320,null,null,null,null,null,null,null,null,"Aug",32622.44,38816.61]
[2020,320025,null,null,null,null,null,null,null,null,"Sep",42147.56,49103.31]
["2020YTD",null,null,null,null,null,null,null,null,null,"Oct",30907.759999999998,38507.879999999997]
[null,null,null,null,null,null,null,null,null,null,"Nov",23809.78,27518.19]
["Location:","Cypress Fairbanks ISD [Cypress Fairbanks ISD]",null,null,null,null,null,null,null,null,"Dec",18813.150000000001,19647.900000000001]
["Time:","2020-05-13T02:32:11","Commodity:","Irrigation","Created By:","Jay Bonham",null,null,null,null,"Jan",19207.25,23700.81]
["Year","Use (KGAL)",null,null,null,null,null,null,null,null,"Feb",24519.43,25096.85]
[2018,145218,null,null,null,null,null,null,null,null,"Mar",22674.94,16698.48]
[2019,91051,null,null,null,null,null,null,null,null,"Apr",30728.49,9518.56]
[2020,125051,null,null,null,null,null,null,null,null,"May",38108.46,12679.73]
["2020YTD",null,null,null,null,null,null,null,null,null,"Jun",25148.06,28]
[null,null,null,null,null,null,null,null,null,null,"Jul",27286.85]
["Location:","Cypress Fairbanks ISD [Cypress Fairbanks ISD]"]
["Time:","2020-05-13T02:32:11","Commodity:","Fire Protection","Created By:","Jay Bonham"]
["Year","Use (KGAL)",null,null,null,null,null,null,null,null,"Location:","Cypress Fairbanks ISD [Cypress Fairbanks ISD]"]
[2018,491,null,null,null,null,null,null,null,null,"Time:","2020-07-08T03:36:05","Commodity:","Irrigation","Created By:","Jay Bonham"]
[2019,198,null,null,null,null,null,null,null,null,"Month","Previous 12 Months (KGAL)","Current 12 Months (KGAL)"]
[2020,356,null,null,null,null,null,null,null,null,"Aug",19986.080000000002,23413.200000000001]
["2020YTD",null,null,null,null,null,null,null,null,null,"Sep",14643.17,18383.900000000001]
[null,null,null,null,null,null,null,null,null,null,"Oct",3057.84,12369]
[null,"Total Water",null,null,null,null,null,null,null,null,"Nov",1651,5697.1]
[null,{"$f":"B6+B14+B22","v":445432},"KGAL",null,null,null,null,null,null,null,"Dec",1313.7,5321.9]
[null,null,null,null,null,null,null,null,null,null,"Jan",866,3354.1]
[null,null,null,null,null,null,null,null,null,null,"Feb",1033.9000000000001,1939]
[null,null,null,null,null,null,null,null,null,null,"Mar",1901.8,3338.9]
[null,null,null,null,null,null,null,null,null,null,"Apr",6638.4,6677.52]
[null,null,null,null,null,null,null,null,null,null,"May",8581.7999999999993,8564.2099999999991]
[null,null,null,null,null,null,null,null,null,null,"Jun",12410.2,136]
[null,null,null,null,null,null,null,null,null,null,"Jul",14314.8]
[]
[]
[null,null,null,null,null,null,null,null,null,null,"Location:","Cypress Fairbanks ISD [Cypress Fairbanks ISD]"]
[null,null,null,null,null,null,null,null,null,null,"Time:","2020-07-08T03:36:05","Commodity:","Fire Protection","Created By:","Jay Bonham"]
[null,null,null,null,null,null,null,null,null,null,"Month","Previous 12 Months (KGAL)","Current 12 Months (KGAL)"]
[null,null,null,null,null,null,null,null,null,null,"Aug",59,30.01]
[null,null,null,null,null,null,null,null,null,null,"Sep",22,0.01]
[null,null,null,null,null,null,null,null,null,null,"Oct",1,32.03]
[null,null,null,null,null,null,null,null,null,null,"Nov",3,44]
[null,null,null,null,null,null,null,null,null,null,"Dec",5,1]
[null,null,null,null,null,null,null,null,null,null,"Jan",1,72]
[null,null,null,null,null,null,null,null,null,null,"Feb",1,21]
[null,null,null,null,null,null,null,null,null,null,"Mar",11,40.01]
[null,null,null,null,null,null,null,null,null,null,"Apr",52,70]
[null,null,null,null,null,null,null,null,null,null,"May",3,27]
[null,null,null,null,null,null,null,null,null,null,"Jun",32.08]
[null,null,null,null,null,null,null,null,null,null,"Jul",7.04]

{"sheet":"Electric Matt","index":8,"n_rows":10,"n_cols":12,"rows_kept":10,"cut":false,"hidden":false,"merged":[]}
[]
[]
[null,null,null,"Average","Average"]
[null,null,"Avg.","Annual","Annual"]
[null,null,"Sq Feet","Cost/Sq.Ft.","Cost",null,null,"School Type Sorted ","COSTS","%","SQU FT","COST/ ft2"]
[null,"High School",{"$f":"VLOOKUP(B6,'Avg. Costs'!$E$4:$F$8,2,FALSE)","v":545728.83333333337},{"$f":"I6/K6","v":0.69019402496844784},{"$f":"I6/G6","v":367131.22666666663},null,12,"High School",4405574.72,0.33608708654093788,6383096,0.69019402496844784]
[null,"Middle School",{"$f":"VLOOKUP(B7,'Avg. Costs'!$E$4:$F$8,2,FALSE)","v":219906.88888888888},{"$f":"I7/K7","v":0.67118795029889045},{"$f":"I7/G7","v":146481.66166666668},null,18,"Middle School",2636669.91,0.20114304365312344,3928363,0.67118795029889045]
[null,"Elementary School",{"$f":"VLOOKUP(B8,'Avg. Costs'!$E$4:$F$8,2,FALSE)","v":95801.946428571435},{"$f":"I8/K8","v":0.7353761478690839},70270.706249999974,null,56,"Elementary School",3935159.5499999989,0.30020063040339218,5351220,0.7353761478690839]
[null,"Special School",{"$f":"VLOOKUP(B9,'Avg. Costs'!$E$4:$F$8,2,FALSE)","v":60443.4},0.89036505061567184,84552.626666666663,null,3,"Special School",253657.87999999998,1.93507415684805E-2,284892,0.89036505061567184]
[null,null,"Wt. Avg.",{"$f":"SUMPRODUCT(C6:C9,D6:D9)/SUM(C6:C9)","v":0.70347988835711073}]

{"sheet":"Gas Matt","index":9,"n_rows":10,"n_cols":12,"rows_kept":10,"cut":false,"hidden":false,"merged":[]}
[]
[]
[null,null,null,"Average","Average"]
[null,null,"Avg.","Annual","Annual"]
[null,null,"Sq Feet","Cost/Sq.Ft.","Cost",null,null,"School Type Sorted ","COSTS","%","SQU FT","COST/ ft2"]
[null,"High School",{"$f":"INDEX('Avg. Costs'!$F$4:$F$8,MATCH('Gas Matt'!B6,'Avg. Costs'!$E$4:$E$8,0))","v":545728.83333333337},{"$f":"E6/C6","v":3.4093846363868752E-2},{"$f":"I6/G6","v":18605.995000000003},null,12,"High School",223271.94000000003,0.30352976202614251,6383096,3.497862792600958E-2]
[null,"Middle School",{"$f":"INDEX('Avg. Costs'!$F$4:$F$8,MATCH('Gas Matt'!B7,'Avg. Costs'!$E$4:$E$8,0))","v":219906.88888888888},{"$f":"E7/C7","v":4.2331746971698121E-2},{"$f":"I7/G7","v":9309.0427777777768},null,18,"Middle School",167562.76999999999,0.22779525139854673,3928363,4.2654604475197429E-2]
[null,"Elementary School",{"$f":"INDEX('Avg. Costs'!$F$4:$F$8,MATCH('Gas Matt'!B8,'Avg. Costs'!$E$4:$E$8,0))","v":95801.946428571435},2.8597814054255162E-2,2739.7262500000002,null,56,"Elementary School",153424.67000000001,0.20857503891460541,5351220,2.8670970358161321E-2]
[null,"Special School",{"$f":"INDEX('Avg. Costs'!$F$4:$F$8,MATCH('Gas Matt'!B9,'Avg. Costs'!$E$4:$E$8,0))","v":60443.4},0.13800789940120289,{"$f":"I9/G9","v":8341.6666666666679},null,3,"Special School",25025.000000000004,3.4020541473792971E-2,284892,8.7840304396051852E-2]
[null,null,"Wt. Avg.",{"$f":"SUMPRODUCT(C6:C9,D6:D9)/SUM(C6:C9)","v":4.2300934492035001E-2}]

{"sheet":"Water Matt","index":10,"n_rows":10,"n_cols":12,"rows_kept":10,"cut":false,"hidden":false,"merged":[]}
[]
[]
[null,null,null,"Average","Average"]
[null,null,"Avg.","Annual","Annual"]
[null,null,"Sq Feet","Cost/Sq.Ft.","Cost",null,null,"School Type Sorted ","COSTS","%","SQU FT","COST/ ft2"]
[null,"High School",{"$f":"INDEX('Avg. Costs'!$F$4:$F$8,MATCH('Water Matt'!B6,'Avg. Costs'!$E$4:$E$8,0))","v":545728.83333333337},{"$f":"E6/C6","v":0.21812687345027579},{"$f":"I6/G6","v":119038.12416666666},null,12,"High School",1428457.49,0.35599521255054423,6383096,0.22378756170986619]
[null,"Middle School",{"$f":"INDEX('Avg. Costs'!$F$4:$F$8,MATCH('Water Matt'!B7,'Avg. Costs'!$E$4:$E$8,0))","v":219906.88888888888},{"$f":"E7/C7","v":0.20021653356319491},{"$f":"I7/G7","v":44028.994999999995},null,18,"Middle School",792521.90999999992,0.19750955683071342,3928363,0.20174355323069684]
[null,"Elementary School",{"$f":"INDEX('Avg. Costs'!$F$4:$F$8,MATCH('Water Matt'!B8,'Avg. Costs'!$E$4:$E$8,0))","v":95801.946428571435},0.20146934645117004,19301.15553571429,null,56,"Elementary School",1080864.7100000002,0.26936934761344028,5351220,0.20198472684733579]
[null,"Special School",{"$f":"INDEX('Avg. Costs'!$F$4:$F$8,MATCH('Water Matt'!B9,'Avg. Costs'!$E$4:$E$8,0))","v":60443.4},0.16562618912900334,10011.01,null,3,"Special School",30033.030000000002,7.4847273882731168E-3,284892,0.10541900088454573]
[null,null,"Wt. Avg.",{"$f":"SUMPRODUCT(C6:C9,D6:D9)/SUM(C6:C9)","v":0.20868124017768905}]

{"sheet":"ALL Matt","index":11,"n_rows":10,"n_cols":12,"rows_kept":10,"cut":false,"hidden":false,"merged":[]}
[]
[]
[null,null,null,"Average","Average"]
[null,null,"Avg.","Annual","Annual"]
[null,null,"Sq Feet","Cost/Sq.Ft.","Cost",null,null,"School Type Sorted ","COSTS","%","SQU FT","COST/ ft2"]
[null,"High School",{"$f":"INDEX('Avg. Costs'!$F$4:$F$8,MATCH(B6,'Avg. Costs'!$E$4:$E$8,0))","v":545728.83333333337},{"$f":"E6/C6","v":0.92495634278684813},{"$f":"I6/G6","v":504775.34583333344},null,12,"High School",6057304.1500000013,0.33921949664303253,6383096,0.94896021460432389]
[null,"Middle School",{"$f":"INDEX('Avg. Costs'!$F$4:$F$8,MATCH(B7,'Avg. Costs'!$E$4:$E$8,0))","v":219906.88888888888},{"$f":"E7/C7","v":0.90865593367293862},{"$f":"I7/G7","v":199819.6994444445},null,18,"Middle School",3596754.5900000008,0.20142447058206855,3928363,0.9155861080047849]
[null,"Elementary School",{"$f":"INDEX('Avg. Costs'!$F$4:$F$8,MATCH(B8,'Avg. Costs'!$E$4:$E$8,0))","v":95801.946428571435},0.96356693655008718,92311.588035714143,null,56,"Elementary School",5169448.9299999923,0.28949807051647886,5351220,0.96603184507457962]
[null,"Special School",{"$f":"INDEX('Avg. Costs'!$F$4:$F$8,MATCH(B9,'Avg. Costs'!$E$4:$E$8,0))","v":60443.4},{"$f":"E9/C9","v":1.7025068631700613},{"$f":"I9/G9","v":102905.30333333329},null,3,"Special School",308715.90999999986,1.7288624279481767E-2,284892,1.083624355896269]
[null,null,"Wt. Avg.",{"$f":"SUMPRODUCT(C6:C9,D6:D9)/SUM(C6:C9)","v":0.97606076016262344}]

{"sheet":"%","index":12,"n_rows":42,"n_cols":10,"rows_kept":42,"cut":false,"hidden":false,"merged":[]}
[]
[]
[]
[null,null,null,"Utility","Electric"]
[]
[null,null,null,"Row Labels","Sum of Area","Sum of Mmbtus","kWh/SF"]
[null,null,null,"Administration",1252106,94970.979623999985,{"$f":"ROUND((F7/E7*1000000)/3412,1)*2","v":44.4}]
[null,null,null,"Elementary School",5351220,172333.71908800004,{"$f":"ROUND((F8/E8*1000000)/3412,1)*2","v":18.8}]
[null,null,null,"High School",6383096,218465.57296400002,{"$f":"ROUND((F9/E9*1000000)/3412,1)*2","v":20}]
[null,null,null,"Middle School",3928363,127981.18909200002,{"$f":"ROUND((F10/E10*1000000)/3412,1)*2","v":19}]
[null,null,null,"Special School",284892,11411.468119999998,{"$f":"ROUND((F11/E11*1000000)/3412,1)*2","v":23.4}]
[null,null,null,"Grand Total",17199677,625162.92888800008,{"$f":"SUMPRODUCT(G7:G11,E7:E11)/SUM(E7:E11)","v":21.230848242091987},"ALL"]
[null,null,null,null,null,null,{"$f":"SUMPRODUCT(F8:F10,G8:G10)/SUM(F8:F10)","v":19.354675697783868},"Schools Only"]
[]
[]
[null,null,null,"Utility","(Multiple Items)"]
[]
[null,null,null,"Row Labels","Sum of Area","Sum of Mmbtus"]
[null,null,null,"Administration",2425975,138536.88962399997]
[null,null,null,"Elementary School",10616315,208334.27908799992]
[null,null,null,"High School",12210350,275828.332964]
[null,null,null,"Middle School",7874474,169152.34909200002]
[null,null,null,"Special School",607661,17035.268119999997]
[null,null,null,"Grand Total",33734775,808887.11888800003,null,null,"kbtus"]
[null,null,null,null,null,null,null,"ALL",41.24]
[null,null,null,null,null,{"$f":"(F22*1000)/((SUM(E8:E10)/2))","v":21.599414645732061},null,"Electric",33.03,{"$f":"I26/I25","v":0.800921435499515}]
[null,null,null,null,null,null,null,"Gas",{"$f":"I25-I26","v":8.2100000000000009},{"$f":"I27/I25","v":0.19907856450048497}]
[]
[]
[null,null,null,"Utility","(Multiple Items)"]
[]
[null,null,null,"Row Labels","Sum of Area","Sum of Mmbtus"]
[null,null,null,"Administration",2425975,138536.88962399997]
[null,null,null,"Elementary School",10616315,208334.27908799992]
[null,null,null,"High School",12210350,275828.332964]
[null,null,null,"Middle School",7874474,169152.34909200002]
[null,null,null,"Special School",607661,17035.268119999997]
[null,null,null,"Grand Total",33734775,808887.11888800003]
[]
[null,null,null,null,null,"kBtus/SF"]
[null,null,null,null,null,"ALL"]
[null,null,null,null,null,{"$f":"F38*1000/(E12/2)","v":94.058408060569974}]