{"text_format":"1","workbook":"xlsx","n_sheets":13,"sheets":["Lookup","Inst","Sheet1","DataYY03","Avg. Costs","Dashboard $","Benchmark","water","Electric Matt","Gas Matt","Water Matt","ALL Matt","%"],"not_rendered":{"charts":4,"images":1,"macros":1,"external_links":0,"defined_names":10,"comments":3,"pivot_tables":12},"unopened":[],"bounds":{"document_bytes":16777216,"sheet_cells":100000,"rows_first":2000,"rows_last":500,"rows_between":2000,"halvings":0,"cell_chars":16384,"cell_head_chars":4096},"cells_cut":0,"cells_raw":0,"read":"whole","date_system":"1900"}

{"sheet":"Lookup","index":0,"n_rows":127,"n_cols":3,"rows_kept":127,"cut":false,"hidden":false,"merged":[]}
["Administration","Electric","BARKERTRANS"]
["Administration","Electric","BERRYCENTER"]
["Administration","Electric","BRADLEYPOLICESTATION"]
["Administration","Electric","CFISDNATATORIUM"]
["Administration","Electric","CY-FAIRCOMPLEXRETENTIONPOND"]
["Administration","Electric","CY-FAIRHS-BALLFIELD"]
["Administration","Electric","ELC1"]
["Administration","Electric","ELC2"]
["Administration","Electric","ELDRIDGETRANS"]
["Administration","Electric","EXHIBITCENTERSCIENCERESOURCEC"]
["Administration","Electric","EXHIBITCENTERTELGEAG"]
["Administration","Electric","FALCONCOMPLEX"]
["Administration","Electric","FOODPRODUCTIONCENTER"]
["Administration","Electric","FOODSERVICEWAREHOUSE"]
["Administration","Electric","ISCA"]
["Administration","Electric","ISCB"]
["Administration","Electric","ISCC"]
["Administration","Electric","ISCC-EXLIGHT"]
["Administration","Electric","ISCD"]
["Administration","Electric","ISCDATACENTER"]
{"$rows_left_out":108}
{"sheet":"Inst","index":1,"n_rows":3,"n_cols":4,"rows_kept":3,"cut":false,"hidden":false,"merged":[]}
["Use WD YY03 reports, paste values"]
["Make sure the total area closly resembles Dan Grozs Area (see Dan's spreadsheet)"]
["Refresh all pivot tables",null,"Start Here","End Here"]

{"sheet":"Sheet1","index":2,"n_rows":133,"n_cols":2,"rows_kept":133,"cut":false,"hidden":false,"merged":[]}
["School Type","(All)"]
[]
["Row Labels"]
["ADAM-ES"]
["ALCABC"]
["ALCWEST"]
["ANDREES"]
["ANTHONYMS"]
["ARAGONMS"]
["ARNOLDMS"]
["AULTES"]
["BANEES"]
["BANGES"]
["BARKERTRANS"]
["BERRYCENTER"]
["BIRKESES"]
["BLACKES"]
["BLEYLMS"]
["BRADLEYPOLICESTATION"]
["BRIDGELANDHS"]
{"$rows_left_out":114}
{"sheet":"DataYY03","index":3,"n_rows":418,"n_cols":18,"rows_kept":418,"cut":false,"hidden":false,"merged":[]}
["School Type","Utility","f","Location","Area","Eff. Date","Base Year ","Mmbtus","Var [%]","Base Year 2","Cost","Var [%]3","Base Year 4","Current Year5","Var [%]6"]
[{"$f":"INDEX(Lookup!$A$1:$A$126,MATCH(DataYY03!C2,Lookup!$C$1:$C$126,0))","v":"Elementary School"},"Electric","ADAM-ES","Houston, TX",103177,"1901-01-01",3731.63616,3353.3136,-10.138248847926301,83845.05,78525.25,-6.3447991264839096,5925,5406,-8.75949367088608]
[{"$f":"INDEX(Lookup!$A$1:$A$126,MATCH(DataYY03!C3,Lookup!$C$1:$C$126,0))","v":"Special School"},"Electric","ALCABC","Houston, TX",56061,"1901-01-01",2507.0830080000001,2126.467584,-15.1816043898615,57548.75,48177.24,-16.284471860813699,4246,3311,-22.020725388601001]
[{"$f":"INDEX(Lookup!$A$1:$A$126,MATCH(DataYY03!C4,Lookup!$C$1:$C$126,0))","v":"Special School"},"Electric","ALCWEST","Katy, TX",50839,"1901-01-01",1845.100416,1986.2753279999999,7.6513403159950402,40143.019999999997,38604.03,-3.8337673647871999,2632,2082,-20.896656534954399]
[{"$f":"INDEX(Lookup!$A$1:$A$126,MATCH(DataYY03!C5,Lookup!$C$1:$C$126,0))","v":"Elementary School"},"Electric","ANDREES","Cypress, TX",106300,"2020-05-01",3862.4931839999999,3430.1245439999998,-11.194029850746301,83470.42,77047.820000000007,-7.6944623017351503,5450,5042,-7.4862385321100904]
[{"$f":"INDEX(Lookup!$A$1:$A$126,MATCH(DataYY03!C6,Lookup!$C$1:$C$126,0))","v":"Middle School"},"Electric","ANTHONYMS","Cypress, TX",244123,"1901-01-01",6930.3929840000001,6136.5195320000003,-11.4549557843659,148222.56,134142.70000000001,-9.4991342748364396,11233,9007,-19.8166117688952]
[{"$f":"INDEX(Lookup!$A$1:$A$126,MATCH(DataYY03!C7,Lookup!$C$1:$C$126,0))","v":"Middle School"},"Electric","ARAGONMS","Houston, TX",219821,"1901-01-01",7749.2798080000002,6806.8137559999996,-12.161982472578201,160667.82999999999,156677.74,-2.4834405244659101,10265,9845,-4.0915733073550902]
[{"$f":"INDEX(Lookup!$A$1:$A$126,MATCH(DataYY03!C8,Lookup!$C$1:$C$126,0))","v":"Middle School"},"Electric","ARNOLDMS","Cypress, TX",212235,"2020-05-01",7975.0518480000001,7444.577972,-6.65166679929529,145448.18,131737.76,-9.4263262696033703,6341,5700,-10.108815644220201]
[{"$f":"INDEX(Lookup!$A$1:$A$126,MATCH(DataYY03!C9,Lookup!$C$1:$C$126,0))","v":"Elementary School"},"Electric","AULTES","Cypress, TX",91912,"2020-05-01",1956.1405440000001,1851.3239040000001,-5.3583389149363603,45215.28,42943.22,-5.0249827049616904,2973,2875,-3.2963336696939098]
[{"$f":"INDEX(Lookup!$A$1:$A$126,MATCH(DataYY03!C10,Lookup!$C$1:$C$126,0))","v":"Elementary School"},"Electric","BANEES","Houston, TX",106804,"1901-01-01",3502.8410880000001,3209.3544959999999,-8.3785300168318706,81293.87,75120.38,-7.5940412235264496,5619,4962,-11.692471970101399]
[{"$f":"INDEX(Lookup!$A$1:$A$126,MATCH(DataYY03!C11,Lookup!$C$1:$C$126,0))","v":"Elementary School"},"Electric","BANGES","Houston, TX",89313,"2020-08-01",2500.85952,2399.6459519999999,-4.0471512770137403,57222.27,53737.17,-6.0904609341782496,3727,3501,-6.0638583310973999]
[{"$f":"INDEX(Lookup!$A$1:$A$126,MATCH(DataYY03!C12,Lookup!$C$1:$C$126,0))","v":"Administration"},"Electric","BARKERTRANS","Houston, TX",22677,"1901-01-01",1149.052416,1060.613376,-7.6966932725199397,22460.85,21157.16,-5.8042772201408201,1297,1208,-6.8619892058596799]
[{"$f":"INDEX(Lookup!$A$1:$A$126,MATCH(DataYY03!C13,Lookup!$C$1:$C$126,0))","v":"Administration"},"Electric","BERRYCENTER","Cypress, TX",491434,"1901-01-01",18486.700504,15252.895616,-17.492601707375002,359401.35,323876.95,-9.8843256988322405,18054,16009,-11.327129721945299]
[{"$f":"INDEX(Lookup!$A$1:$A$126,MATCH(DataYY03!C14,Lookup!$C$1:$C$126,0))","v":"Elementary School"},"Electric","BIRKESES","Houston, TX",104952,"2020-08-01",4208.3880959999997,4227.3861120000001,0.451432129514309,91267.09,91830.34,0.61714469038072794,6244,5851,-6.2940422805893697]
[{"$f":"INDEX(Lookup!$A$1:$A$126,MATCH(DataYY03!C15,Lookup!$C$1:$C$126,0))","v":"Elementary School"},"Electric","BLACKES","Cypress, TX",99456,"2020-08-01",3103.882752,2955.1741440000001,-4.7910510764035497,71456.06,69063.33,-3.34853335042542,5045,4696,-6.9177403369672996]
[{"$f":"INDEX(Lookup!$A$1:$A$126,MATCH(DataYY03!C16,Lookup!$C$1:$C$126,0))","v":"Middle School"},"Electric","BLEYLMS","Houston, TX",229363,"1901-01-01",6747.9021640000001,6594.9831480000003,-2.2661712082285801,140671.25,133101.68,-5.38103557052347,7303,6820,-6.6137203888812799]
[{"$f":"INDEX(Lookup!$A$1:$A$126,MATCH(DataYY03!C17,Lookup!$C$1:$C$126,0))","v":"Administration"},"Electric","BRADLEYPOLICESTATION","Cypress, TX",19680,"2020-05-01",1957.7783039999999,1952.8650239999999,-0.250962021080814,33906.99,33833.4,-0.21703489457483499,1507,1504,-0.19907100199071001]
[{"$f":"INDEX(Lookup!$A$1:$A$126,MATCH(DataYY03!C18,Lookup!$C$1:$C$126,0))","v":"Special School"},"Electric","BRAUTIGAMCENTER","Houston, TX",85895,43952,2646.5382719999998,2829.3293480000002,6.9067988902297097,57831.59,68263.7,18.038774310026799,3136,4612,47.066326530612201]
[{"$f":"INDEX(Lookup!$A$1:$A$126,MATCH(DataYY03!C19,Lookup!$C$1:$C$126,0))","v":"High School"},"Electric","BRIDGELANDHS","Cypress, TX",573468,"1901-01-01",18077.151320000001,17029.322708,-5.7964255177790003,378802.98,360504.21,-4.8306826942068897,25360,24410,-3.7460567823343802]
[{"$f":"INDEX(Lookup!$A$1:$A$126,MATCH(DataYY03!C20,Lookup!$C$1:$C$126,0))","v":"Middle School"},"Electric","CAMPBELLMS","Houston, TX",228967,"2020-08-01",8693.079952,8529.8874039999992,-1.87726960871278,185774.22,165320.09,-11.010209059147201,10789,10315,-4.3933636110853698]
{"$rows_left_out":399}
{"sheet":"Avg. Costs","index":4,"n_rows":9,"n_cols":6,"rows_kept":9,"cut":false,"hidden":false,"merged":[]}
["Utility","(All)",null,null,"Utility","(All)"]
[]
["Row Labels","Sum of Cost","Cost/SF",null,"Row Labels","Average of Area"]
["Administration",2427868.36,{"$f":"B4/F4","v":66.19206155765697},null,"Administration",36679.147058823532]
["Elementary School",4840936.2800000021,{"$f":"B5/F5","v":50.530667282520561},null,"Elementary School",95801.946428571435]
["High School",5670347.2200000025,93.812512532385711,null,"Special School",60443.4]
["Middle School",3324811.61,15.119178970695678,null,"Middle School",219906.88888888888]
["Special School",309680.71999999997,0.56746263177713707,null,"High School",545728.83333333337]
["Grand Total",16573644.190000005,null,null,"Grand Total",139370.296]

{"sheet":"Dashboard $","index":5,"n_rows":52,"n_cols":51,"rows_kept":52,"cut":false,"hidden":false,"merged":[[3,0,3,15],[15,8,15,9],[21,7,21,9],[24,0,24,2],[15,10,15,11],[14,7,14,11]]}
[]
[]
[]
["CFISD Energy Management Dept. Utilities (CY 2020)"]
[]
["School Type Sorted ","UTILITY COSTS","%","SQU FT","COST/ ft2"]
[{"$f":"INDEX($AR$10:$AR$14,MATCH(AX10,$AW$10:$AW$14,0))","v":"High School"},{"$f":"INDEX($AS$10:$AS$14,MATCH(AX10,$AW$10:$AW$14,0))","v":5670347.2200000025},{"$f":"B7/$B$12","v":0.34213038605149249},{"$f":"INDEX($AV$10:$AV$14,MATCH(A7,$AU$10:$AU$14,0))","v":6548746},{"$f":"B7/D7","v":0.8658676363383162},null,null,null,null,null,null,null,null,null,null,null,null,null,null,null,null,null,null,null,null,null,null,null,null,null,null,null,null,null,null,null,null,null,null,null,null,null,null,"Utility","(All)",null,"Utility","(All)"]
[{"$f":"INDEX($AR$10:$AR$14,MATCH(AX11,$AW$10:$AW$14,0))","v":"Elementary School"},{"$f":"INDEX($AS$10:$AS$14,MATCH(AX11,$AW$10:$AW$14,0))","v":4840936.2800000021},{"$f":"B8/$B$12","v":0.29208641624014625},{"$f":"INDEX($AV$10:$AV$14,MATCH(A8,$AU$10:$AU$14,0))","v":5364909},{"$f":"B8/D8","v":0.90233334433072432},null,null,null,null,null,null,null,null,null,null,null,null,null,null,null,null,null,null,null,null,null,null,null,null,null,null,null,null,null,null,null,null,null,"Matt"]
[{"$f":"INDEX($AR$10:$AR$14,MATCH(AX12,$AW$10:$AW$14,0))","v":"Middle School"},{"$f":"INDEX($AS$10:$AS$14,MATCH(AX12,$AW$10:$AW$14,0))","v":3324811.61},{"$f":"B9/$B$12","v":0.20060836409904786},{"$f":"INDEX($AV$10:$AV$14,MATCH(A9,$AU$10:$AU$14,0))","v":3958324},0.83995438726087102,null,null,null,null,null,null,null,null,null,null,null,null,null,null,null,null,null,null,null,null,null,null,null,null,null,null,null,null,null,null,null,null,null,{"$f":"AV10/12","v":103924.25},{"$f":"#REF!","v":{"$error":"#REF!"}},{"$f":"AS10/12","v":202322.36333333331},null,null,"Row Labels","Sum of Cost",null,"Row Labels","Sum of Area"]
[{"$f":"INDEX($AR$10:$AR$14,MATCH(AX13,$AW$10:$AW$14,0))","v":"Administration"},{"$f":"INDEX($AS$10:$AS$14,MATCH(AX13,$AW$10:$AW$14,0))","v":2427868.36},{"$f":"B10/$B$12","v":0.14648971342693254},{"$f":"INDEX($AV$10:$AV$14,MATCH(A10,$AU$10:$AU$14,0))","v":1247091},1.9468253399310875,null,null,null,null,null,null,null,null,null,null,null,null,null,null,null,null,null,null,null,null,null,null,null,null,null,null,null,null,null,null,null,null,null,{"$f":"AV11/18","v":298050.5},{"$f":"#REF!","v":{"$error":"#REF!"}},{"$f":"AS11/18","v":268940.90444444458},null,null,"Administration",2427868.36,null,"Administration",1247091,{"$f":"RANK(AS10,$AS$10:$AS$14,0)","v":4},1,{"$f":"AV10","v":1247091}]
[{"$f":"INDEX($AR$10:$AR$14,MATCH(AX14,$AW$10:$AW$14,0))","v":"Special School"},{"$f":"INDEX($AS$10:$AS$14,MATCH(AX14,$AW$10:$AW$14,0))","v":309680.71999999997},{"$f":"B11/$B$12","v":1.8685131646365757E-2},{"$f":"INDEX($AV$10:$AV$14,MATCH(A11,$AU$10:$AU$14,0))","v":302217},1.0246965590949548,null,null,null,null,null,null,null,null,null,null,null,null,null,null,null,null,null,null,null,null,null,null,null,null,null,null,null,null,null,null,null,null,null,{"$f":"AV12/56","v":5396.7321428571431},{"$f":"#REF!","v":{"$error":"#REF!"}},{"$f":"AS12/56","v":5530.0128571428568},null,null,"Elementary School",4840936.2800000021,null,"Elementary School",5364909,{"$f":"RANK(AS11,$AS$10:$AS$14,0)","v":2},2,{"$f":"AV11","v":5364909}]
[{"$f":"\"% Expenses ( \"&ROUND(B12/AN23*100,1)&\"%)\"","v":"% Expenses ( 100%)"},{"$f":"ROUND(SUM(B7:B11),0)","v":16573644},null,{"$f":"IFERROR(SUM(D7:D11),\"\")","v":17421287},"Total Squ Ft.",null,null,null,null,null,null,null,null,null,null,null,null,null,null,null,null,null,null,null,null,null,null,null,null,null,null,null,null,null,null,null,null,null,{"$f":"AV13/4","v":989581},{"$f":"#REF!","v":{"$error":"#REF!"}},{"$f":"AS13/4","v":831202.90249999997},null,null,"Special School",309680.71999999997,null,"Special School",302217,{"$f":"RANK(AS12,$AS$10:$AS$14,0)","v":5},3,{"$f":"AV12","v":302217}]
[null,null,null,null,null,null,null,null,null,null,null,null,null,null,null,null,null,null,null,null,null,null,null,null,null,null,null,null,null,null,null,null,null,null,null,null,null,null,null,null,null,null,null,"Middle School",3324811.61,null,"Middle School",3958324,{"$f":"RANK(AS13,$AS$10:$AS$14,0)","v":3},4,{"$f":"AV13","v":3958324}]
[null,null,null,null,null,null,null,null,null,null,null,null,null,null,null,null,null,null,null,null,null,null,null,null,null,null,null,null,null,null,null,null,null,null,null,null,null,null,null,null,null,null,null,"High School",5670347.2200000025,null,"High School",6548746,{"$f":"RANK(AS14,$AS$10:$AS$14,0)","v":1},5,{"$f":"AV14","v":6548746}]
[null,null,null,null,"Costs per Squ. ft.",null,null,"Consumption",null,null,null,null,null,null,null,null,null,null,null,null,null,null,null,null,null,null,null,null,null,null,null,null,null,null,null,null,null,null,null,null,null,null,null,"Grand Total",16573644.190000005,null,"Grand Total",17421287,null,null,{"$f":"SUM(AY10:AY14)","v":17421287}]
[null,null,null,null,"Total",{"$f":"B12/D12","v":0.95134440985904201},null,"Utility","Annual Usage",null,"Blended Rate"]
[null,null,null,null,"Schools Only",{"$f":"SUM(AS11,AS13,AS14)/SUM(AV11,AV13,AV14)","v":0.87173093600993334},null,"Electric",{"$f":"Benchmark!F13","v":172614128},"kWhs",{"$f":"AS29/I17","v":7.1876193297457092E-2},"Per kWh",null,null,null,null,null,null,null,null,null,null,null,null,null,null,null,null,null,null,null,null,null,null,null,null,null,null,"Utility","Costs"]
[null,null,null,null,null,null,null,"Water",{"$f":"water!B26*1000","v":445432000},"Gallons",{"$f":"AS40/(I18/1000)","v":7.8027869124804674},"Per kGal",null,null,null,null,null,null,null,null,null,null,null,null,null,null,null,null,null,null,null,null,null,null,null,null,null,null,"Electric",12406846.430000003]
[null,null,null,null,null,null,null,"Natural Gas",{"$f":"Benchmark!F47*10","v":1911309.1999999981},"Therms",{"$f":"AS52/I19","v":0.36163001779094694},"Per Therm",null,null,null,null,null,null,null,null,null,null,null,null,null,null,null,null,null,null,null,null,null,null,null,null,null,null,"Fire",23342.94]
[null,null,null,null,null,null,null,null,null,null,null,null,null,null,null,null,null,null,null,null,null,null,null,null,null,null,null,null,null,null,null,null,null,null,null,null,null,null,"Irrigation",748082.26000000013,null,null,null,"Electric Only"]
{"$rows_left_out":33}
{"sheet":"Benchmark","index":6,"n_rows":47,"n_cols":8,"rows_kept":47,"cut":false,"hidden":false,"merged":[]}
[]
[]
[]
[null,null,null,"Utility","Electric"]
[]
[null,null,null,"Row Labels","Sum of Area","Sum of Mmbtus","kWh/SF"]
[null,null,null,"Administration",1247091,89104.304936,{"$f":"ROUND((F7/E7*1000000)/3412,1)","v":20.9}]
[null,null,null,"Elementary School",5364909,164734.88459599996,{"$f":"ROUND((F8/E8*1000000)/3412,1)","v":9}]
[null,null,null,"High School",6548746,208058.56011200004,9.3000000000000007]
[null,null,null,"Middle School",3958324,115569.503408,8.6]
[null,null,null,"Special School",302217,11492.151684,11.1]
[null,null,null,"Grand Total",17421287,588959.404736,{"$f":"SUMPRODUCT(G7:G11,E7:E11)/SUM(E7:E11)","v":9.9101700006434665},"ALL"]
[null,null,null,null,null,{"$f":"ROUND(F12*1000/3.412,0)","v":172614128},{"$f":"SUMPRODUCT(F8:F10,G8:G10)/SUM(F8:F10)","v":9.0331510953745724},"Schools Only"]
[]
[]
[null,null,null,"Utility","(Multiple Items)"]
[]
[null,null,null,"Row Labels","Sum of Area","Sum of Mmbtus"]
[null,null,null,"Administration",2419705,128532.70493599999]
[null,null,null,"Elementary School",10643974,203409.32459599979]
{"$rows_left_out":28}
{"sheet":"water","index":7,"n_rows":50,"n_cols":16,"rows_kept":50,"cut":false,"hidden":false,"merged":[]}
["Location:","Cypress Fairbanks ISD [Cypress Fairbanks ISD]"]
["Time:","2020-05-13T02:32:11","Commodity:","Water","Created By:","Jay Bonham",null,null,null,null,"Location:","Cypress Fairbanks ISD [Cypress Fairbanks ISD]"]
["Year","Use (KGAL)",null,null,null,null,null,null,null,null,"Time:","2020-07-08T03:36:05","Commodity:","Water","Created By:","Jay Bonham"]
[2018,332391,null,null,null,null,null,null,null,null,"Month","Previous 12 Months (KGAL)","Current 12 Months (KGAL)"]
[2019,338320,null,null,null,null,null,null,null,null,"Aug",32622.44,38816.61]
[2020,320025,null,null,null,null,null,null,null,null,"Sep",42147.56,49103.31]
["2020YTD",null,null,null,null,null,null,null,null,null,"Oct",30907.759999999998,38507.879999999997]
[null,null,null,null,null,null,null,null,null,null,"Nov",23809.78,27518.19]
["Location:","Cypress Fairbanks ISD [Cypress Fairbanks ISD]",null,null,null,null,null,null,null,null,"Dec",18813.150000000001,19647.900000000001]
["Time:","2020-05-13T02:32:11","Commodity:","Irrigation","Created By:","Jay Bonham",null,null,null,null,"Jan",19207.25,23700.81]
["Year","Use (KGAL)",null,null,null,null,null,null,null,null,"Feb",24519.43,25096.85]
[2018,145218,null,null,null,null,null,null,null,null,"Mar",22674.94,16698.48]
[2019,91051,null,null,null,null,null,null,null,null,"Apr",30728.49,9518.56]
[2020,125051,null,null,null,null,null,null,null,null,"May",38108.46,12679.73]
["2020YTD",null,null,null,null,null,null,null,null,null,"Jun",25148.06,28]
[null,null,null,null,null,null,null,null,null,null,"Jul",27286.85]
["Location:","Cypress Fairbanks ISD [Cypress Fairbanks ISD]"]
["Time:","2020-05-13T02:32:11","Commodity:","Fire Protection","Created By:","Jay Bonham"]
["Year","Use (KGAL)",null,null,null,null,null,null,null,null,"Location:","Cypress Fairbanks ISD [Cypress Fairbanks ISD]"]
[2018,491,null,null,null,null,null,null,null,null,"Time:","2020-07-08T03:36:05","Commodity:","Irrigation","Created By:","Jay Bonham"]
{"$rows_left_out":31}
{"sheet":"Electric Matt","index":8,"n_rows":10,"n_cols":12,"rows_kept":10,"cut":false,"hidden":false,"merged":[]}
[]
[]
[null,null,null,"Average","Average"]
[null,null,"Avg.","Annual","Annual"]
[null,null,"Sq Feet","Cost/Sq.Ft.","Cost",null,null,"School Type Sorted ","COSTS","%","SQU FT","COST/ ft2"]
[null,"High School",{"$f":"VLOOKUP(B6,'Avg. Costs'!$E$4:$F$8,2,FALSE)","v":545728.83333333337},{"$f":"I6/K6","v":0.69019402496844784},{"$f":"I6/G6","v":367131.22666666663},null,12,"High School",4405574.72,0.33608708654093788,6383096,0.69019402496844784]
[null,"Middle School",{"$f":"VLOOKUP(B7,'Avg. Costs'!$E$4:$F$8,2,FALSE)","v":219906.88888888888},{"$f":"I7/K7","v":0.67118795029889045},{"$f":"I7/G7","v":146481.66166666668},null,18,"Middle School",2636669.91,0.20114304365312344,3928363,0.67118795029889045]
[null,"Elementary School",{"$f":"VLOOKUP(B8,'Avg. Costs'!$E$4:$F$8,2,FALSE)","v":95801.946428571435},{"$f":"I8/K8","v":0.7353761478690839},70270.706249999974,null,56,"Elementary School",3935159.5499999989,0.30020063040339218,5351220,0.7353761478690839]
[null,"Special School",{"$f":"VLOOKUP(B9,'Avg. Costs'!$E$4:$F$8,2,FALSE)","v":60443.4},0.89036505061567184,84552.626666666663,null,3,"Special School",253657.87999999998,1.93507415684805E-2,284892,0.89036505061567184]
[null,null,"Wt. Avg.",{"$f":"SUMPRODUCT(C6:C9,D6:D9)/SUM(C6:C9)","v":0.70347988835711073}]

{"sheet":"Gas Matt","index":9,"n_rows":10,"n_cols":12,"rows_kept":10,"cut":false,"hidden":false,"merged":[]}
[]
[]
[null,null,null,"Average","Average"]
[null,null,"Avg.","Annual","Annual"]
[null,null,"Sq Feet","Cost/Sq.Ft.","Cost",null,null,"School Type Sorted ","COSTS","%","SQU FT","COST/ ft2"]
[null,"High School",{"$f":"INDEX('Avg. Costs'!$F$4:$F$8,MATCH('Gas Matt'!B6,'Avg. Costs'!$E$4:$E$8,0))","v":545728.83333333337},{"$f":"E6/C6","v":3.4093846363868752E-2},{"$f":"I6/G6","v":18605.995000000003},null,12,"High School",223271.94000000003,0.30352976202614251,6383096,3.497862792600958E-2]
[null,"Middle School",{"$f":"INDEX('Avg. Costs'!$F$4:$F$8,MATCH('Gas Matt'!B7,'Avg. Costs'!$E$4:$E$8,0))","v":219906.88888888888},{"$f":"E7/C7","v":4.2331746971698121E-2},{"$f":"I7/G7","v":9309.0427777777768},null,18,"Middle School",167562.76999999999,0.22779525139854673,3928363,4.2654604475197429E-2]
[null,"Elementary School",{"$f":"INDEX('Avg. Costs'!$F$4:$F$8,MATCH('Gas Matt'!B8,'Avg. Costs'!$E$4:$E$8,0))","v":95801.946428571435},2.8597814054255162E-2,2739.7262500000002,null,56,"Elementary School",153424.67000000001,0.20857503891460541,5351220,2.8670970358161321E-2]
[null,"Special School",{"$f":"INDEX('Avg. Costs'!$F$4:$F$8,MATCH('Gas Matt'!B9,'Avg. Costs'!$E$4:$E$8,0))","v":60443.4},0.13800789940120289,{"$f":"I9/G9","v":8341.6666666666679},null,3,"Special School",25025.000000000004,3.4020541473792971E-2,284892,8.7840304396051852E-2]
[null,null,"Wt. Avg.",{"$f":"SUMPRODUCT(C6:C9,D6:D9)/SUM(C6:C9)","v":4.2300934492035001E-2}]

{"sheet":"Water Matt","index":10,"n_rows":10,"n_cols":12,"rows_kept":10,"cut":false,"hidden":false,"merged":[]}
[]
[]
[null,null,null,"Average","Average"]
[null,null,"Avg.","Annual","Annual"]
[null,null,"Sq Feet","Cost/Sq.Ft.","Cost",null,null,"School Type Sorted ","COSTS","%","SQU FT","COST/ ft2"]
[null,"High School",{"$f":"INDEX('Avg. Costs'!$F$4:$F$8,MATCH('Water Matt'!B6,'Avg. Costs'!$E$4:$E$8,0))","v":545728.83333333337},{"$f":"E6/C6","v":0.21812687345027579},{"$f":"I6/G6","v":119038.12416666666},null,12,"High School",1428457.49,0.35599521255054423,6383096,0.22378756170986619]
[null,"Middle School",{"$f":"INDEX('Avg. Costs'!$F$4:$F$8,MATCH('Water Matt'!B7,'Avg. Costs'!$E$4:$E$8,0))","v":219906.88888888888},{"$f":"E7/C7","v":0.20021653356319491},{"$f":"I7/G7","v":44028.994999999995},null,18,"Middle School",792521.90999999992,0.19750955683071342,3928363,0.20174355323069684]
[null,"Elementary School",{"$f":"INDEX('Avg. Costs'!$F$4:$F$8,MATCH('Water Matt'!B8,'Avg. Costs'!$E$4:$E$8,0))","v":95801.946428571435},0.20146934645117004,19301.15553571429,null,56,"Elementary School",1080864.7100000002,0.26936934761344028,5351220,0.20198472684733579]
[null,"Special School",{"$f":"INDEX('Avg. Costs'!$F$4:$F$8,MATCH('Water Matt'!B9,'Avg. Costs'!$E$4:$E$8,0))","v":60443.4},0.16562618912900334,10011.01,null,3,"Special School",30033.030000000002,7.4847273882731168E-3,284892,0.10541900088454573]
[null,null,"Wt. Avg.",{"$f":"SUMPRODUCT(C6:C9,D6:D9)/SUM(C6:C9)","v":0.20868124017768905}]

{"sheet":"ALL Matt","index":11,"n_rows":10,"n_cols":12,"rows_kept":10,"cut":false,"hidden":false,"merged":[]}
[]
[]
[null,null,null,"Average","Average"]
[null,null,"Avg.","Annual","Annual"]
[null,null,"Sq Feet","Cost/Sq.Ft.","Cost",null,null,"School Type Sorted ","COSTS","%","SQU FT","COST/ ft2"]
[null,"High School",{"$f":"INDEX('Avg. Costs'!$F$4:$F$8,MATCH(B6,'Avg. Costs'!$E$4:$E$8,0))","v":545728.83333333337},{"$f":"E6/C6","v":0.92495634278684813},{"$f":"I6/G6","v":504775.34583333344},null,12,"High School",6057304.1500000013,0.33921949664303253,6383096,0.94896021460432389]
[null,"Middle School",{"$f":"INDEX('Avg. Costs'!$F$4:$F$8,MATCH(B7,'Avg. Costs'!$E$4:$E$8,0))","v":219906.88888888888},{"$f":"E7/C7","v":0.90865593367293862},{"$f":"I7/G7","v":199819.6994444445},null,18,"Middle School",3596754.5900000008,0.20142447058206855,3928363,0.9155861080047849]
[null,"Elementary School",{"$f":"INDEX('Avg. Costs'!$F$4:$F$8,MATCH(B8,'Avg. Costs'!$E$4:$E$8,0))","v":95801.946428571435},0.96356693655008718,92311.588035714143,null,56,"Elementary School",5169448.9299999923,0.28949807051647886,5351220,0.96603184507457962]
[null,"Special School",{"$f":"INDEX('Avg. Costs'!$F$4:$F$8,MATCH(B9,'Avg. Costs'!$E$4:$E$8,0))","v":60443.4},{"$f":"E9/C9","v":1.7025068631700613},{"$f":"I9/G9","v":102905.30333333329},null,3,"Special School",308715.90999999986,1.7288624279481767E-2,284892,1.083624355896269]
[null,null,"Wt. Avg.",{"$f":"SUMPRODUCT(C6:C9,D6:D9)/SUM(C6:C9)","v":0.97606076016262344}]

{"sheet":"%","index":12,"n_rows":42,"n_cols":10,"rows_kept":42,"cut":false,"hidden":false,"merged":[]}
[]
[]
[]
[null,null,null,"Utility","Electric"]
[]
[null,null,null,"Row Labels","Sum of Area","Sum of Mmbtus","kWh/SF"]
[null,null,null,"Administration",1252106,94970.979623999985,{"$f":"ROUND((F7/E7*1000000)/3412,1)*2","v":44.4}]
[null,null,null,"Elementary School",5351220,172333.71908800004,{"$f":"ROUND((F8/E8*1000000)/3412,1)*2","v":18.8}]
[null,null,null,"High School",6383096,218465.57296400002,{"$f":"ROUND((F9/E9*1000000)/3412,1)*2","v":20}]
[null,null,null,"Middle School",3928363,127981.18909200002,{"$f":"ROUND((F10/E10*1000000)/3412,1)*2","v":19}]
[null,null,null,"Special School",284892,11411.468119999998,{"$f":"ROUND((F11/E11*1000000)/3412,1)*2","v":23.4}]
[null,null,null,"Grand Total",17199677,625162.92888800008,{"$f":"SUMPRODUCT(G7:G11,E7:E11)/SUM(E7:E11)","v":21.230848242091987},"ALL"]
[null,null,null,null,null,null,{"$f":"SUMPRODUCT(F8:F10,G8:G10)/SUM(F8:F10)","v":19.354675697783868},"Schools Only"]
[]
[]
[null,null,null,"Utility","(Multiple Items)"]
[]
[null,null,null,"Row Labels","Sum of Area","Sum of Mmbtus"]
[null,null,null,"Administration",2425975,138536.88962399997]
[null,null,null,"Elementary School",10616315,208334.27908799992]
{"$rows_left_out":22}