{"text_format":"1","workbook":"xlsx","n_sheets":13,"sheets":["Utility Pie","Sheet3","Sheet1","DataYY03","Avg. Costs","Dashboard $","Benchmark","water","Electric Matt","Gas Matt","Water Matt","ALL Matt","%"],"not_rendered":{"charts":4,"images":1,"macros":1,"external_links":0,"defined_names":11,"comments":1,"pivot_tables":13},"unopened":[],"bounds":{"document_bytes":16777216,"sheet_cells":100000,"rows_first":2000,"rows_last":500,"rows_between":2000,"halvings":0,"cell_chars":16384,"cell_head_chars":4096},"cells_cut":0,"cells_raw":0,"read":"whole","date_system":"1900"}

{"sheet":"Utility Pie","index":0,"n_rows":0,"n_cols":0,"rows_kept":0,"cut":false,"hidden":false,"merged":[]}

{"sheet":"Sheet3","index":1,"n_rows":821,"n_cols":3,"rows_kept":821,"cut":false,"hidden":false,"merged":[]}
["ALCABC","Special Schools","Electric"]
["ALCWEST","Special Schools","Electric"]
["ANDREES","Elementary Schools","Electric"]
["ANTHONYMS","Middle Schools","Electric"]
["ARAGONMS","Middle Schools","Electric"]
["ARNOLDMS","Middle Schools","Electric"]
["AULTES","Elementary Schools","Electric"]
["BANEES","Elementary Schools","Electric"]
["BANGES","Elementary Schools","Electric"]
["BARKERTRANS","Administration","Electric"]
["BERRYCENTER","Administration","Electric"]
["BIRKESES","Elementary Schools","Electric"]
["BLACKES","Elementary Schools","Electric"]
["BLEYLMS","Middle Schools","Electric"]
["BRADLEYPOLICESTATION","Administration","Electric"]
["BRIDGELANDHS","High Schools","Electric"]
["CAMPBELLMS","Middle Schools","Electric"]
["CFISDNATATORIUM","Administration","Electric"]
["COOKMS","Middle Schools","Electric"]
["COPELANDES","Elementary Schools","Electric"]
["CY-CREEKHS","High Schools","Electric"]
["CY-FAIRCOMPLEXRETENTIONPOND","Administration","Electric"]
["CY-FAIRHS","High Schools","Electric"]
["CY-FAIRHS-BALLFIELD","Administration","Electric"]
["CY-FALLSHS","High Schools","Electric"]
["CY-LAKESHS","High Schools","Electric"]
["CY-PARKHS","High Schools","Electric"]
["CY-RANCHHS","High Schools","Electric"]
["CY-RIDGEHS","High Schools","Electric"]
["CY-SPRINGSHS","High Schools","Electric"]
["CY-WOODSHS","High Schools","Electric"]
["DANISHES","Elementary Schools","Electric"]
["DEANMS","Middle Schools","Electric"]
["DURYEAES","Elementary Schools","Electric"]
["ELC1","Administration","Electric"]
["ELC2","Administration","Electric"]
["ELDRIDGETRANS","Administration","Electric"]
["EMERYES","Elementary Schools","Electric"]
["EMMOTTES","Elementary Schools","Electric"]
["EXHIBITCENTERSCIENCERESOURCEC","Administration","Electric"]
["EXHIBITCENTERTELGEAG","Administration","Electric"]
["FALCONCOMPLEX","Administration","Electric"]
["FARNEYES","Elementary Schools","Electric"]
["FIESTES","Elementary Schools","Electric"]
["FOODPRODUCTIONCENTER","Administration","Electric"]
["FOODSERVICEWAREHOUSE","Administration","Electric"]
["FRANCONEES","Elementary Schools","Electric"]
["FRAZIERES","Elementary Schools","Electric"]
["GLEASONES","Elementary Schools","Electric"]
["GOODSONMS","Middle Schools","Electric"]
["HAIRGROVEES","Elementary Schools","Electric"]
["HAMILTONES","Elementary Schools","Electric"]
["HAMILTONMS","Middle Schools","Electric"]
["HANCOCKES","Elementary Schools","Electric"]
["HEMMENWAYES","Elementary Schools","Electric"]
["HOLBROOKES","Elementary Schools","Electric"]
["HOLMSLEYES","Elementary Schools","Electric"]
["HOOVERES","Elementary Schools","Electric"]
["HOPPERMS","Middle Schools","Electric"]
["HORNEES","Elementary Schools","Electric"]
["ISCA","Administration","Electric"]
["ISCB","Administration","Electric"]
["ISCC","Administration","Electric"]
["ISCC-EXLIGHT","Administration","Electric"]
["ISCD","Administration","Electric"]
["ISCDATACENTER","Administration","Electric"]
["ISCSW","Administration","Electric"]
["ISCW","Administration","Electric"]
["JARVISCENTRALPLANT","Administration","Electric"]
["JERSEYVILLAGEHS","High Schools","Electric"]
["JERSEYVILLAGESTADIUM","Administration","Electric"]
["JOWELLES","Elementary Schools","Electric"]
["KAHLAMS","Middle Schools","Electric"]
["KEITHES","Elementary Schools","Electric"]
["KIRKES","Elementary Schools","Electric"]
["LABAYMS","Middle Schools","Electric"]
["LAMKINES","Elementary Schools","Electric"]
["LANGHAMCREEKHS","High Schools","Electric"]
["LANGHAMCREEKRETENTIONPOND","Administration","Electric"]
["LEEES","Elementary Schools","Electric"]
["LIEDERES","Elementary Schools","Electric"]
["LOWERYES","Elementary Schools","Electric"]
["MAINTENANCEOPER","Administration","Electric"]
["MATZKEES","Elementary Schools","Electric"]
["MATZKEMILLSES","Elementary Schools","Electric"]
["MCFEEES","Elementary Schools","Electric"]
["METCALFES","Elementary Schools","Electric"]
["MILLSAPES","Elementary Schools","Electric"]
["MILLSAPNATURETRAIL","Administration","Electric"]
["MILLSAPROPES","Administration","Electric"]
["MOOREES","Elementary Schools","Electric"]
["OWENSES","Elementary Schools","Electric"]
["POPEES","Elementary Schools","Electric"]
["POSTES","Elementary Schools","Electric"]
["POSTMAES","Elementary Schools","Electric"]
["PRIDGEONSTADIUM","Administration","Electric"]
["RECYCLECENTER","Administration","Electric"]
["REEDES","Elementary Schools","Electric"]
["RENNELLES","Elementary Schools","Electric"]
["ROBINSONES","Elementary Schools","Electric"]
["ROBISONES","Elementary Schools","Electric"]
["SALYARDSMS","Middle Schools","Electric"]
["SAMPSONES","Elementary Schools","Electric"]
["SATELLITECOLDFOODWAREHOUSE","Administration","Electric"]
["SHERIDANES","Elementary Schools","Electric"]
["SMITHMS","Middle Schools","Electric"]
["SPILLANEMS","Middle Schools","Electric"]
["SWENKEES","Elementary Schools","Electric"]
["TELGETRANS","Administration","Electric"]
["THORNTONMS","Middle Schools","Electric"]
["TIPPSES","Elementary Schools","Electric"]
["TRUITTMS","Middle Schools","Electric"]
["WALKERES","Elementary Schools","Electric"]
["WARNERES","Elementary Schools","Electric"]
["WATKINSMS","Middle Schools","Electric"]
["WELLSES","Elementary Schools","Electric"]
["WESTGREENAGSCIENCECENTER","Administration","Electric"]
["WESTGREENTRANS","Administration","Electric"]
["WILLBERNES","Elementary Schools","Electric"]
["WILSONES","Elementary Schools","Electric"]
["WINDFERNANNEX","Special Schools","Electric"]
["WINDFERNHS","Special Schools","Electric"]
["WOODARDES","Elementary Schools","Electric"]
["YEAGERES","Elementary Schools","Electric"]
["ADAM-ES","Elementary Schools","Electric"]
["ALCABC","Special Schools","Electric"]
["ALCWEST","Special Schools","Electric"]
["ANDREES","Elementary Schools","Electric"]
["ANTHONYMS","Middle Schools","Electric"]
["ARAGONMS","Middle Schools","Electric"]
["ARNOLDMS","Middle Schools","Electric"]
["AULTES","Elementary Schools","Electric"]
["BANEES","Elementary Schools","Electric"]
["BANGES","Elementary Schools","Electric"]
["BARKERTRANS","Administration","Electric"]
["BERRYCENTER","Administration","Electric"]
["BIRKESES","Elementary Schools","Electric"]
["BLACKES","Elementary Schools","Electric"]
["BLEYLMS","Middle Schools","Electric"]
["BRADLEYPOLICESTATION","Administration","Electric"]
["BRIDGELANDHS","High Schools","Electric"]
["CAMPBELLMS","Middle Schools","Electric"]
["CFISDNATATORIUM","Administration","Electric"]
["COOKMS","Middle Schools","Electric"]
["COPELANDES","Elementary Schools","Electric"]
["CY-CREEKHS","High Schools","Electric"]
["CY-FAIRCOMPLEXRETENTIONPOND","Administration","Electric"]
["CY-FAIRHS","High Schools","Electric"]
["CY-FAIRHS-BALLFIELD","Administration","Electric"]
["CY-FALLSHS","High Schools","Electric"]
["CY-LAKESHS","High Schools","Electric"]
["CY-PARKHS","High Schools","Electric"]
["CY-RANCHHS","High Schools","Electric"]
["CY-RIDGEHS","High Schools","Electric"]
["CY-SPRINGSHS","High Schools","Electric"]
["CY-WOODSHS","High Schools","Electric"]
["DANISHES","Elementary Schools","Electric"]
["DEANMS","Middle Schools","Electric"]
["DURYEAES","Elementary Schools","Electric"]
["ELC1","Administration","Electric"]
["ELC2","Administration","Electric"]
["ELDRIDGETRANS","Administration","Electric"]
["EMERYES","Elementary Schools","Electric"]
["EMMOTTES","Elementary Schools","Electric"]
["EXHIBITCENTERSCIENCERESOURCEC","Administration","Electric"]
["EXHIBITCENTERTELGEAG","Administration","Electric"]
["FALCONCOMPLEX","Administration","Electric"]
["FARNEYES","Elementary Schools","Electric"]
["FIESTES","Elementary Schools","Electric"]
["FOODPRODUCTIONCENTER","Administration","Electric"]
["FOODSERVICEWAREHOUSE","Administration","Electric"]
["FRANCONEES","Elementary Schools","Electric"]
["FRAZIERES","Elementary Schools","Electric"]
["GLEASONES","Elementary Schools","Electric"]
["GOODSONMS","Middle Schools","Electric"]
["HAIRGROVEES","Elementary Schools","Electric"]
["HAMILTONES","Elementary Schools","Electric"]
["HAMILTONMS","Middle Schools","Electric"]
["HANCOCKES","Elementary Schools","Electric"]
["HEMMENWAYES","Elementary Schools","Electric"]
["HOLBROOKES","Elementary Schools","Electric"]
["HOLMSLEYES","Elementary Schools","Electric"]
["HOOVERES","Elementary Schools","Electric"]
["HOPPERMS","Middle Schools","Electric"]
["HORNEES","Elementary Schools","Electric"]
["ISCA","Administration","Electric"]
["ISCB","Administration","Electric"]
["ISCC","Administration","Electric"]
["ISCC-EXLIGHT","Administration","Electric"]
["ISCD","Administration","Electric"]
["ISCDATACENTER","Administration","Electric"]
["ISCSW","Administration","Electric"]
["ISCW","Administration","Electric"]
["JARVISCENTRALPLANT","Administration","Electric"]
["JERSEYVILLAGEHS","High Schools","Electric"]
["JERSEYVILLAGESTADIUM","Administration","Electric"]
["JOWELLES","Elementary Schools","Electric"]
["KAHLAMS","Middle Schools","Electric"]
["KEITHES","Elementary Schools","Electric"]
["KIRKES","Elementary Schools","Electric"]
["LABAYMS","Middle Schools","Electric"]
["LAMKINES","Elementary Schools","Electric"]
["LANGHAMCREEKHS","High Schools","Electric"]
["LANGHAMCREEKRETENTIONPOND","Administration","Electric"]
["LEEES","Elementary Schools","Electric"]
["LIEDERES","Elementary Schools","Electric"]
["LOWERYES","Elementary Schools","Electric"]
["MAINTENANCEOPER","Administration","Electric"]
["MATZKEES","Elementary Schools","Electric"]
["MATZKEMILLSES","Elementary Schools","Electric"]
["MCFEEES","Elementary Schools","Electric"]
["METCALFES","Elementary Schools","Electric"]
["MILLSAPES","Elementary Schools","Electric"]
["MILLSAPNATURETRAIL","Administration","Electric"]
["MILLSAPROPES","Administration","Electric"]
["MOOREES","Elementary Schools","Electric"]
["OWENSES","Elementary Schools","Electric"]
["POPEES","Elementary Schools","Electric"]
["POSTES","Elementary Schools","Electric"]
["POSTMAES","Elementary Schools","Electric"]
["PRIDGEONSTADIUM","Administration","Electric"]
["RECYCLECENTER","Administration","Electric"]
["REEDES","Elementary Schools","Electric"]
["RENNELLES","Elementary Schools","Electric"]
["ROBINSONES","Elementary Schools","Electric"]
["ROBISONES","Elementary Schools","Electric"]
["SALYARDSMS","Middle Schools","Electric"]
["SAMPSONES","Elementary Schools","Electric"]
["SATELLITECOLDFOODWAREHOUSE","Administration","Electric"]
["SHERIDANES","Elementary Schools","Electric"]
["SMITHMS","Middle Schools","Electric"]
["SPILLANEMS","Middle Schools","Electric"]
["SWENKEES","Elementary Schools","Electric"]
["TELGETRANS","Administration","Electric"]
["THORNTONMS","Middle Schools","Electric"]
["TIPPSES","Elementary Schools","Electric"]
["TRUITTMS","Middle Schools","Electric"]
["WALKERES","Elementary Schools","Electric"]
["WARNERES","Elementary Schools","Electric"]
["WATKINSMS","Middle Schools","Electric"]
["WELLSES","Elementary Schools","Electric"]
["WESTGREENAGSCIENCECENTER","Administration","Electric"]
["WESTGREENTRANS","Administration","Electric"]
["WILLBERNES","Elementary Schools","Electric"]
["WILSONES","Elementary Schools","Electric"]
["WINDFERNANNEX","Special Schools","Electric"]
["WINDFERNHS","Special Schools","Electric"]
["WOODARDES","Elementary Schools","Electric"]
["YEAGERES","Elementary Schools","Electric"]
["ADAM-ES","Elementary Schools","Water"]
["ALCWEST","Special Schools","Water"]
["ANDREES","Elementary Schools","Water"]
["ANTHONYMS","Middle Schools","Water"]
["ARAGONMS","Middle Schools","Water"]
["AULTES","Elementary Schools","Water"]
["BANEES","Elementary Schools","Water"]
["BANGES","Elementary Schools","Water"]
["BARKERTRANS","Administration","Water"]
["BERRYCENTER","Administration","Water"]
["BIRKESES","Elementary Schools","Water"]
["BLACKES","Elementary Schools","Water"]
["BLEYLMS","Middle Schools","Water"]
["BRADLEYPOLICESTATION","Administration","Water"]
["BRIDGELANDHS","High Schools","Water"]
["COOKMS","Middle Schools","Water"]
["COPELANDES","Elementary Schools","Water"]
["CY-CREEKHS","High Schools","Water"]
["CY-FAIRCOMPLEX","Administration","Water"]
["CY-FALLSHS","High Schools","Water"]
["CY-LAKESHS","High Schools","Water"]
["CY-PARKHS","High Schools","Water"]
["CY-RANCHHS","High Schools","Water"]
["CY-RIDGEHS","High Schools","Water"]
["CY-SPRINGSHS","High Schools","Water"]
["CY-WOODSHS","High Schools","Water"]
["DANISHES","Elementary Schools","Water"]
["DEANMS","Middle Schools","Water"]
["DURYEAES","Elementary Schools","Water"]
["ELC1","Administration","Water"]
["ELC2","Administration","Water"]
["ELDRIDGETRANS","Administration","Water"]
["EMERYES","Elementary Schools","Water"]
["EMMOTTES","Elementary Schools","Water"]
["FALCONCOMPLEX","Administration","Water"]
["FARNEYES","Elementary Schools","Water"]
["FIESTES","Elementary Schools","Water"]
["FRANCONEES","Elementary Schools","Water"]
["FRAZIERES","Elementary Schools","Water"]
["GLEASONES","Elementary Schools","Water"]
["GOODSONMS","Middle Schools","Water"]
["HAIRGROVEES","Elementary Schools","Water"]
["HAMILTONES","Elementary Schools","Water"]
["HAMILTONMS","Middle Schools","Water"]
["HANCOCKES","Elementary Schools","Water"]
["HEMMENWAYES","Elementary Schools","Water"]
["HOLBROOKES","Elementary Schools","Water"]
["HOLMSLEYES","Elementary Schools","Water"]
["HOOVERES","Elementary Schools","Water"]
["HOPPERMS","Middle Schools","Water"]
["HORNEES","Elementary Schools","Water"]
["ISCA","Administration","Water"]
["ISCW","Administration","Water"]
["JARVISCENTRALPLANT","Administration","Water"]
["JERSEYVILLAGEHS","High Schools","Water"]
["JOWELLES","Elementary Schools","Water"]
["KAHLAMS","Middle Schools","Water"]
["KEITHES","Elementary Schools","Water"]
["KIRKES","Elementary Schools","Water"]
["LABAYMS","Middle Schools","Water"]
["LANGHAMCREEKHS","High Schools","Water"]
["LEEES","Elementary Schools","Water"]
["LIEDERES","Elementary Schools","Water"]
["LOWERYES","Elementary Schools","Water"]
["MAINTENANCEOPER","Administration","Water"]
["MATZKEES","Elementary Schools","Water"]
["MATZKEMILLSES","Elementary Schools","Water"]
["MCFEEES","Elementary Schools","Water"]
["METCALFES","Elementary Schools","Water"]
["MILLSAPES","Elementary Schools","Water"]
["MOOREES","Elementary Schools","Water"]
["OWENSES","Elementary Schools","Water"]
["POPEES","Elementary Schools","Water"]
["POSTES","Elementary Schools","Water"]
["POSTMAES","Elementary Schools","Water"]
["REEDES","Elementary Schools","Water"]
["RENNELLES","Elementary Schools","Water"]
["ROBINSONES","Elementary Schools","Water"]
["ROBISONES","Elementary Schools","Water"]
["SALYARDSMS","Middle Schools","Water"]
["SAMPSONES","Elementary Schools","Water"]
["SATELLITECOLDFOODWAREHOUSE","Administration","Water"]
["SHERIDANES","Elementary Schools","Water"]
["SMITHMS","Middle Schools","Water"]
["SPILLANEMS","Middle Schools","Water"]
["SWENKEES","Elementary Schools","Water"]
["THORNTONMS","Middle Schools","Water"]
["TIPPSES","Elementary Schools","Water"]
["TRUITTMS","Middle Schools","Water"]
["WALKERES","Elementary Schools","Water"]
["WARNERES","Elementary Schools","Water"]
["WATKINSMS","Middle Schools","Water"]
["WELLSES","Elementary Schools","Water"]
["WESTGREENAGSCIENCECENTER","Administration","Water"]
["WESTGREENTRANS","Administration","Water"]
["WILLBERNES","Elementary Schools","Water"]
["WILSONES","Elementary Schools","Water"]
["WOODARDES","Elementary Schools","Water"]
["YEAGERES","Elementary Schools","Water"]
["ADAM-ES","Elementary Schools","Water"]
["ALCWEST","Special Schools","Water"]
["ANDREES","Elementary Schools","Water"]
["ANTHONYMS","Middle Schools","Water"]
["ARAGONMS","Middle Schools","Water"]
["AULTES","Elementary Schools","Water"]
["BANEES","Elementary Schools","Water"]
["BANGES","Elementary Schools","Water"]
["BARKERTRANS","Administration","Water"]
["BERRYCENTER","Administration","Water"]
["BIRKESES","Elementary Schools","Water"]
["BLACKES","Elementary Schools","Water"]
["BLEYLMS","Middle Schools","Water"]
["BRADLEYPOLICESTATION","Administration","Water"]
["BRIDGELANDHS","High Schools","Water"]
["COOKMS","Middle Schools","Water"]
["COPELANDES","Elementary Schools","Water"]
["CY-CREEKHS","High Schools","Water"]
["CY-FAIRCOMPLEX","Administration","Water"]
["CY-FALLSHS","High Schools","Water"]
["CY-LAKESHS","High Schools","Water"]
["CY-PARKHS","High Schools","Water"]
["CY-RANCHHS","High Schools","Water"]
["CY-RIDGEHS","High Schools","Water"]
["CY-SPRINGSHS","High Schools","Water"]
["CY-WOODSHS","High Schools","Water"]
["DANISHES","Elementary Schools","Water"]
["DEANMS","Middle Schools","Water"]
["DURYEAES","Elementary Schools","Water"]
["ELC1","Administration","Water"]
["ELC2","Administration","Water"]
["ELDRIDGETRANS","Administration","Water"]
["EMERYES","Elementary Schools","Water"]
["EMMOTTES","Elementary Schools","Water"]
["FALCONCOMPLEX","Administration","Water"]
["FARNEYES","Elementary Schools","Water"]
["FIESTES","Elementary Schools","Water"]
["FRANCONEES","Elementary Schools","Water"]
["FRAZIERES","Elementary Schools","Water"]
["GLEASONES","Elementary Schools","Water"]
["GOODSONMS","Middle Schools","Water"]
["HAIRGROVEES","Elementary Schools","Water"]
["HAMILTONES","Elementary Schools","Water"]
["HAMILTONMS","Middle Schools","Water"]
["HANCOCKES","Elementary Schools","Water"]
["HEMMENWAYES","Elementary Schools","Water"]
["HOLBROOKES","Elementary Schools","Water"]
["HOLMSLEYES","Elementary Schools","Water"]
["HOOVERES","Elementary Schools","Water"]
["HOPPERMS","Middle Schools","Water"]
["HORNEES","Elementary Schools","Water"]
["ISCA","Administration","Water"]
["ISCW","Administration","Water"]
["JARVISCENTRALPLANT","Administration","Water"]
["JERSEYVILLAGEHS","High Schools","Water"]
["JOWELLES","Elementary Schools","Water"]
["KAHLAMS","Middle Schools","Water"]
["KEITHES","Elementary Schools","Water"]
["KIRKES","Elementary Schools","Water"]
["LABAYMS","Middle Schools","Water"]
["LANGHAMCREEKHS","High Schools","Water"]
["LEEES","Elementary Schools","Water"]
["LIEDERES","Elementary Schools","Water"]
["LOWERYES","Elementary Schools","Water"]
["MAINTENANCEOPER","Administration","Water"]
["MATZKEES","Elementary Schools","Water"]
["MATZKEMILLSES","Elementary Schools","Water"]
["MCFEEES","Elementary Schools","Water"]
["METCALFES","Elementary Schools","Water"]
["MILLSAPES","Elementary Schools","Water"]
["MOOREES","Elementary Schools","Water"]
["OWENSES","Elementary Schools","Water"]
["POPEES","Elementary Schools","Water"]
["POSTES","Elementary Schools","Water"]
["POSTMAES","Elementary Schools","Water"]
["REEDES","Elementary Schools","Water"]
["RENNELLES","Elementary Schools","Water"]
["ROBINSONES","Elementary Schools","Water"]
["ROBISONES","Elementary Schools","Water"]
["SALYARDSMS","Middle Schools","Water"]
["SAMPSONES","Elementary Schools","Water"]
["SATELLITECOLDFOODWAREHOUSE","Administration","Water"]
["SHERIDANES","Elementary Schools","Water"]
["SMITHMS","Middle Schools","Water"]
["SPILLANEMS","Middle Schools","Water"]
["SWENKEES","Elementary Schools","Water"]
["THORNTONMS","Middle Schools","Water"]
["TIPPSES","Elementary Schools","Water"]
["TRUITTMS","Middle Schools","Water"]
["WALKERES","Elementary Schools","Water"]
["WARNERES","Elementary Schools","Water"]
["WATKINSMS","Middle Schools","Water"]
["WELLSES","Elementary Schools","Water"]
["WESTGREENAGSCIENCECENTER","Administration","Water"]
["WESTGREENTRANS","Administration","Water"]
["WILLBERNES","Elementary Schools","Water"]
["WILSONES","Elementary Schools","Water"]
["WOODARDES","Elementary Schools","Water"]
["YEAGERES","Elementary Schools","Water"]
["ALCWEST","Special Schools","Irrigation"]
["ANDREES","Elementary Schools","Irrigation"]
["ANTHONYMS","Middle Schools","Irrigation"]
["ARAGONMS","Middle Schools","Irrigation"]
["BERRYCENTER","Administration","Irrigation"]
["BIRKESES","Elementary Schools","Irrigation"]
["BLACKES","Elementary Schools","Irrigation"]
["BRADLEYPOLICESTATION","Administration","Irrigation"]
["BRIDGELANDHS","High Schools","Irrigation"]
["COOKMS","Middle Schools","Irrigation"]
["CY-FALLSHS","High Schools","Irrigation"]
["CY-LAKESHS","High Schools","Irrigation"]
["CY-PARKHS","High Schools","Irrigation"]
["CY-RANCHHS","High Schools","Irrigation"]
["CY-RIDGEHS","High Schools","Irrigation"]
["CY-SPRINGSHS","High Schools","Irrigation"]
["CY-WOODSHS","High Schools","Irrigation"]
["DANISHES","Elementary Schools","Irrigation"]
["DEANMS","Middle Schools","Irrigation"]
["DURYEAES","Elementary Schools","Irrigation"]
["ELDRIDGETRANS","Administration","Irrigation"]
["EMERYES","Elementary Schools","Irrigation"]
["FARNEYES","Elementary Schools","Irrigation"]
["GLEASONES","Elementary Schools","Irrigation"]
["GOODSONMS","Middle Schools","Irrigation"]
["HEMMENWAYES","Elementary Schools","Irrigation"]
["HOOVERES","Elementary Schools","Irrigation"]
["HOPPERMS","Middle Schools","Irrigation"]
["ISCW","Administration","Irrigation"]
["JERSEYVILLAGESTADIUM","Administration","Irrigation"]
["JOWELLES","Elementary Schools","Irrigation"]
["KAHLAMS","Middle Schools","Irrigation"]
["KEITHES","Elementary Schools","Irrigation"]
["KIRKES","Elementary Schools","Irrigation"]
["LANGHAMCREEKHS","High Schools","Irrigation"]
["LEEES","Elementary Schools","Irrigation"]
["LOWERYES","Elementary Schools","Irrigation"]
["MATZKEMILLSES","Elementary Schools","Irrigation"]
["MCFEEES","Elementary Schools","Irrigation"]
["POPEES","Elementary Schools","Irrigation"]
["POSTMAES","Elementary Schools","Irrigation"]
["RENNELLES","Elementary Schools","Irrigation"]
["ROBINSONES","Elementary Schools","Irrigation"]
["ROBISONES","Elementary Schools","Irrigation"]
["SALYARDSMS","Middle Schools","Irrigation"]
["SAMPSONES","Elementary Schools","Irrigation"]
["SATELLITECOLDFOODWAREHOUSE","Administration","Irrigation"]
["SMITHMS","Middle Schools","Irrigation"]
["SPILLANEMS","Middle Schools","Irrigation"]
["SWENKEES","Elementary Schools","Irrigation"]
["TIPPSES","Elementary Schools","Irrigation"]
["WALKERES","Elementary Schools","Irrigation"]
["WARNERES","Elementary Schools","Irrigation"]
["WELLSES","Elementary Schools","Irrigation"]
["WESTGREENTRANS","Administration","Irrigation"]
["WOODARDES","Elementary Schools","Irrigation"]
["YEAGERES","Elementary Schools","Irrigation"]
["ALCWEST","Special Schools","Irrigation"]
["ANDREES","Elementary Schools","Irrigation"]
["ANTHONYMS","Middle Schools","Irrigation"]
["ARAGONMS","Middle Schools","Irrigation"]
["BERRYCENTER","Administration","Irrigation"]
["BIRKESES","Elementary Schools","Irrigation"]
["BLACKES","Elementary Schools","Irrigation"]
["BRADLEYPOLICESTATION","Administration","Irrigation"]
["BRIDGELANDHS","High Schools","Irrigation"]
["COOKMS","Middle Schools","Irrigation"]
["CY-FALLSHS","High Schools","Irrigation"]
["CY-LAKESHS","High Schools","Irrigation"]
["CY-PARKHS","High Schools","Irrigation"]
["CY-RANCHHS","High Schools","Irrigation"]
["CY-RIDGEHS","High Schools","Irrigation"]
["CY-SPRINGSHS","High Schools","Irrigation"]
["CY-WOODSHS","High Schools","Irrigation"]
["DANISHES","Elementary Schools","Irrigation"]
["DEANMS","Middle Schools","Irrigation"]
["DURYEAES","Elementary Schools","Irrigation"]
["ELDRIDGETRANS","Administration","Irrigation"]
["EMERYES","Elementary Schools","Irrigation"]
["FARNEYES","Elementary Schools","Irrigation"]
["GLEASONES","Elementary Schools","Irrigation"]
["GOODSONMS","Middle Schools","Irrigation"]
["HEMMENWAYES","Elementary Schools","Irrigation"]
["HOOVERES","Elementary Schools","Irrigation"]
["HOPPERMS","Middle Schools","Irrigation"]
["ISCW","Administration","Irrigation"]
["JERSEYVILLAGESTADIUM","Administration","Irrigation"]
["JOWELLES","Elementary Schools","Irrigation"]
["KAHLAMS","Middle Schools","Irrigation"]
["KEITHES","Elementary Schools","Irrigation"]
["KIRKES","Elementary Schools","Irrigation"]
["LANGHAMCREEKHS","High Schools","Irrigation"]
["LEEES","Elementary Schools","Irrigation"]
["LOWERYES","Elementary Schools","Irrigation"]
["MATZKEMILLSES","Elementary Schools","Irrigation"]
["MCFEEES","Elementary Schools","Irrigation"]
["POPEES","Elementary Schools","Irrigation"]
["POSTMAES","Elementary Schools","Irrigation"]
["RENNELLES","Elementary Schools","Irrigation"]
["ROBINSONES","Elementary Schools","Irrigation"]
["ROBISONES","Elementary Schools","Irrigation"]
["SALYARDSMS","Middle Schools","Irrigation"]
["SAMPSONES","Elementary Schools","Irrigation"]
["SATELLITECOLDFOODWAREHOUSE","Administration","Irrigation"]
["SMITHMS","Middle Schools","Irrigation"]
["SPILLANEMS","Middle Schools","Irrigation"]
["SWENKEES","Elementary Schools","Irrigation"]
["TIPPSES","Elementary Schools","Irrigation"]
["WALKERES","Elementary Schools","Irrigation"]
["WARNERES","Elementary Schools","Irrigation"]
["WELLSES","Elementary Schools","Irrigation"]
["WESTGREENTRANS","Administration","Irrigation"]
["WOODARDES","Elementary Schools","Irrigation"]
["YEAGERES","Elementary Schools","Irrigation"]
["ADAM-ES","Elementary Schools","Nat_Gas"]
["ALCABC","Special Schools","Nat_Gas"]
["ALCWEST","Special Schools","Nat_Gas"]
["ANDREES","Elementary Schools","Nat_Gas"]
["ANTHONYMS","Middle Schools","Nat_Gas"]
["ARAGONMS","Middle Schools","Nat_Gas"]
["ARNOLDMS","Middle Schools","Nat_Gas"]
["AULTES","Elementary Schools","Nat_Gas"]
["BANEES","Elementary Schools","Nat_Gas"]
["BANGES","Elementary Schools","Nat_Gas"]
["BARKERTRANS","Administration","Nat_Gas"]
["BERRYCENTER","Administration","Nat_Gas"]
["BIRKESES","Elementary Schools","Nat_Gas"]
["BLACKES","Elementary Schools","Nat_Gas"]
["BLEYLMS","Middle Schools","Nat_Gas"]
["BRADLEYPOLICESTATION","Administration","Nat_Gas"]
["BRIDGELANDHS","High Schools","Nat_Gas"]
["CAMPBELLMS","Middle Schools","Nat_Gas"]
["CFISDNATATORIUM","Administration","Nat_Gas"]
["COOKMS","Middle Schools","Nat_Gas"]
["COPELANDES","Elementary Schools","Nat_Gas"]
["CY-CREEKHS","High Schools","Nat_Gas"]
["CY-FALLSAGVOC","High Schools","Nat_Gas"]
["CY-FALLSHS","High Schools","Nat_Gas"]
["CY-LAKESHS","High Schools","Nat_Gas"]
["CY-PARKHS","High Schools","Nat_Gas"]
["CY-RANCHHS","High Schools","Nat_Gas"]
["CY-RIDGEHS","High Schools","Nat_Gas"]
["CY-SPRINGSHS","High Schools","Nat_Gas"]
["CY-WOODSCARLTONCENTERKITCHEN","Special Schools","Nat_Gas"]
["CY-WOODSHS","High Schools","Nat_Gas"]
["DANISHES","Elementary Schools","Nat_Gas"]
["DEANMS","Middle Schools","Nat_Gas"]
["DURYEAES","Elementary Schools","Nat_Gas"]
["ELC1","Administration","Nat_Gas"]
["ELDRIDGETRANS","Administration","Nat_Gas"]
["EMERYES","Elementary Schools","Nat_Gas"]
["EMMOTTES","Elementary Schools","Nat_Gas"]
["EXHIBITCENTERSCIENCERESOURCEC","Administration","Nat_Gas"]
["FALCONCOMPLEX","Administration","Nat_Gas"]
["FARNEYES","Elementary Schools","Nat_Gas"]
["FIESTES","Elementary Schools","Nat_Gas"]
["FOODPRODUCTIONCENTER","Administration","Nat_Gas"]
["FOODSERVICEWAREHOUSE","Administration","Nat_Gas"]
["FRANCONEES","Elementary Schools","Nat_Gas"]
["GLEASONES","Elementary Schools","Nat_Gas"]
["GOODSONMS","Middle Schools","Nat_Gas"]
["HAIRGROVEES","Elementary Schools","Nat_Gas"]
["HAMILTONES","Elementary Schools","Nat_Gas"]
["HAMILTONMS","Middle Schools","Nat_Gas"]
["HANCOCKES","Elementary Schools","Nat_Gas"]
["HEMMENWAYES","Elementary Schools","Nat_Gas"]
["HOLBROOKES","Elementary Schools","Nat_Gas"]
["HOLMSLEYES","Elementary Schools","Nat_Gas"]
["HOOVERES","Elementary Schools","Nat_Gas"]
["HOPPERMS","Middle Schools","Nat_Gas"]
["HORNEES","Elementary Schools","Nat_Gas"]
["ISCA","Administration","Nat_Gas"]
["ISCW","Administration","Nat_Gas"]
["JERSEYVILLAGEHS","High Schools","Nat_Gas"]
["JOWELLES","Elementary Schools","Nat_Gas"]
["KAHLAMS","Middle Schools","Nat_Gas"]
["KEITHES","Elementary Schools","Nat_Gas"]
["KIRKES","Elementary Schools","Nat_Gas"]
["LABAYMS","Middle Schools","Nat_Gas"]
["LAMKINES","Elementary Schools","Nat_Gas"]
["LANGHAMCREEKHS","High Schools","Nat_Gas"]
["LANGHAMCREEKRETENTIONPOND","Administration","Nat_Gas"]
["LEEES","Elementary Schools","Nat_Gas"]
["LIEDERES","Elementary Schools","Nat_Gas"]
["LOWERYES","Elementary Schools","Nat_Gas"]
["MAINTENANCEOPER","Administration","Nat_Gas"]
["MATZKEES","Elementary Schools","Nat_Gas"]
["MATZKEMILLSES","Elementary Schools","Nat_Gas"]
["MCFEEES","Elementary Schools","Nat_Gas"]
["METCALFES","Elementary Schools","Nat_Gas"]
["MILLSAPES","Elementary Schools","Nat_Gas"]
["MOOREES","Elementary Schools","Nat_Gas"]
["OWENSES","Elementary Schools","Nat_Gas"]
["POPEES","Elementary Schools","Nat_Gas"]
["POSTES","Elementary Schools","Nat_Gas"]
["POSTMAES","Elementary Schools","Nat_Gas"]
["PRIDGEONSTADIUM","Administration","Nat_Gas"]
["REEDES","Elementary Schools","Nat_Gas"]
["RENNELLES","Elementary Schools","Nat_Gas"]
["ROBINSONES","Elementary Schools","Nat_Gas"]
["ROBISONES","Elementary Schools","Nat_Gas"]
["SALYARDSMS","Middle Schools","Nat_Gas"]
["SAMPSONES","Elementary Schools","Nat_Gas"]
["SATELLITECOLDFOODWAREHOUSE","Administration","Nat_Gas"]
["SHERIDANES","Elementary Schools","Nat_Gas"]
["SMITHMS","Middle Schools","Nat_Gas"]
["SPILLANEMS","Middle Schools","Nat_Gas"]
["SWENKEES","Elementary Schools","Nat_Gas"]
["TELGETRANS","Administration","Nat_Gas"]
["THORNTONMS","Middle Schools","Nat_Gas"]
["TIPPSES","Elementary Schools","Nat_Gas"]
["TRUITTMS","Middle Schools","Nat_Gas"]
["WALKERES","Elementary Schools","Nat_Gas"]
["WARNERES","Elementary Schools","Nat_Gas"]
["WATKINSMS","Middle Schools","Nat_Gas"]
["WELLSES","Elementary Schools","Nat_Gas"]
["WESTGREENTRANS","Administration","Nat_Gas"]
["WILLBERNES","Elementary Schools","Nat_Gas"]
["WILSONES","Elementary Schools","Nat_Gas"]
["WINDFERNANNEX","Special Schools","Nat_Gas"]
["WINDFERNHS","Special Schools","Nat_Gas"]
["WOODARDES","Elementary Schools","Nat_Gas"]
["YEAGERES","Elementary Schools","Nat_Gas"]
["ADAM-ES","Elementary Schools","Nat_Gas"]
["ALCABC","Special Schools","Nat_Gas"]
["ALCWEST","Special Schools","Nat_Gas"]
["ANDREES","Elementary Schools","Nat_Gas"]
["ANTHONYMS","Middle Schools","Nat_Gas"]
["ARAGONMS","Middle Schools","Nat_Gas"]
["ARNOLDMS","Middle Schools","Nat_Gas"]
["AULTES","Elementary Schools","Nat_Gas"]
["BANEES","Elementary Schools","Nat_Gas"]
["BANGES","Elementary Schools","Nat_Gas"]
["BARKERTRANS","Administration","Nat_Gas"]
["BERRYCENTER","Administration","Nat_Gas"]
["BIRKESES","Elementary Schools","Nat_Gas"]
["BLACKES","Elementary Schools","Nat_Gas"]
["BLEYLMS","Middle Schools","Nat_Gas"]
["BRADLEYPOLICESTATION","Administration","Nat_Gas"]
["BRIDGELANDHS","High Schools","Nat_Gas"]
["CAMPBELLMS","Middle Schools","Nat_Gas"]
["CFISDNATATORIUM","Administration","Nat_Gas"]
["COOKMS","Middle Schools","Nat_Gas"]
["COPELANDES","Elementary Schools","Nat_Gas"]
["CY-CREEKHS","High Schools","Nat_Gas"]
["CY-FALLSAGVOC","High Schools","Nat_Gas"]
["CY-FALLSHS","High Schools","Nat_Gas"]
["CY-LAKESHS","High Schools","Nat_Gas"]
["CY-PARKHS","High Schools","Nat_Gas"]
["CY-RANCHHS","High Schools","Nat_Gas"]
["CY-RIDGEHS","High Schools","Nat_Gas"]
["CY-SPRINGSHS","High Schools","Nat_Gas"]
["CY-WOODSCARLTONCENTERKITCHEN","Special Schools","Nat_Gas"]
["CY-WOODSHS","High Schools","Nat_Gas"]
["DANISHES","Elementary Schools","Nat_Gas"]
["DEANMS","Middle Schools","Nat_Gas"]
["DURYEAES","Elementary Schools","Nat_Gas"]
["ELC1","Administration","Nat_Gas"]
["ELDRIDGETRANS","Administration","Nat_Gas"]
["EMERYES","Elementary Schools","Nat_Gas"]
["EMMOTTES","Elementary Schools","Nat_Gas"]
["EXHIBITCENTERSCIENCERESOURCEC","Administration","Nat_Gas"]
["FALCONCOMPLEX","Administration","Nat_Gas"]
["FARNEYES","Elementary Schools","Nat_Gas"]
["FIESTES","Elementary Schools","Nat_Gas"]
["FOODPRODUCTIONCENTER","Administration","Nat_Gas"]
["FOODSERVICEWAREHOUSE","Administration","Nat_Gas"]
["FRANCONEES","Elementary Schools","Nat_Gas"]
["GLEASONES","Elementary Schools","Nat_Gas"]
["GOODSONMS","Middle Schools","Nat_Gas"]
["HAIRGROVEES","Elementary Schools","Nat_Gas"]
["HAMILTONES","Elementary Schools","Nat_Gas"]
["HAMILTONMS","Middle Schools","Nat_Gas"]
["HANCOCKES","Elementary Schools","Nat_Gas"]
["HEMMENWAYES","Elementary Schools","Nat_Gas"]
["HOLBROOKES","Elementary Schools","Nat_Gas"]
["HOLMSLEYES","Elementary Schools","Nat_Gas"]
["HOOVERES","Elementary Schools","Nat_Gas"]
["HOPPERMS","Middle Schools","Nat_Gas"]
["HORNEES","Elementary Schools","Nat_Gas"]
["ISCA","Administration","Nat_Gas"]
["ISCW","Administration","Nat_Gas"]
["JERSEYVILLAGEHS","High Schools","Nat_Gas"]
["JOWELLES","Elementary Schools","Nat_Gas"]
["KAHLAMS","Middle Schools","Nat_Gas"]
["KEITHES","Elementary Schools","Nat_Gas"]
["KIRKES","Elementary Schools","Nat_Gas"]
["LABAYMS","Middle Schools","Nat_Gas"]
["LAMKINES","Elementary Schools","Nat_Gas"]
["LANGHAMCREEKHS","High Schools","Nat_Gas"]
["LANGHAMCREEKRETENTIONPOND","Administration","Nat_Gas"]
["LEEES","Elementary Schools","Nat_Gas"]
["LIEDERES","Elementary Schools","Nat_Gas"]
["LOWERYES","Elementary Schools","Nat_Gas"]
["MAINTENANCEOPER","Administration","Nat_Gas"]
["MATZKEES","Elementary Schools","Nat_Gas"]
["MATZKEMILLSES","Elementary Schools","Nat_Gas"]
["MCFEEES","Elementary Schools","Nat_Gas"]
["METCALFES","Elementary Schools","Nat_Gas"]
["MILLSAPES","Elementary Schools","Nat_Gas"]
["MOOREES","Elementary Schools","Nat_Gas"]
["OWENSES","Elementary Schools","Nat_Gas"]
["POPEES","Elementary Schools","Nat_Gas"]
["POSTES","Elementary Schools","Nat_Gas"]
["POSTMAES","Elementary Schools","Nat_Gas"]
["PRIDGEONSTADIUM","Administration","Nat_Gas"]
["REEDES","Elementary Schools","Nat_Gas"]
["RENNELLES","Elementary Schools","Nat_Gas"]
["ROBINSONES","Elementary Schools","Nat_Gas"]
["ROBISONES","Elementary Schools","Nat_Gas"]
["SALYARDSMS","Middle Schools","Nat_Gas"]
["SAMPSONES","Elementary Schools","Nat_Gas"]
["SATELLITECOLDFOODWAREHOUSE","Administration","Nat_Gas"]
["SHERIDANES","Elementary Schools","Nat_Gas"]
["SMITHMS","Middle Schools","Nat_Gas"]
["SPILLANEMS","Middle Schools","Nat_Gas"]
["SWENKEES","Elementary Schools","Nat_Gas"]
["TELGETRANS","Administration","Nat_Gas"]
["THORNTONMS","Middle Schools","Nat_Gas"]
["TIPPSES","Elementary Schools","Nat_Gas"]
["TRUITTMS","Middle Schools","Nat_Gas"]
["WALKERES","Elementary Schools","Nat_Gas"]
["WARNERES","Elementary Schools","Nat_Gas"]
["WATKINSMS","Middle Schools","Nat_Gas"]
["WELLSES","Elementary Schools","Nat_Gas"]
["WESTGREENTRANS","Administration","Nat_Gas"]
["WILLBERNES","Elementary Schools","Nat_Gas"]
["WILSONES","Elementary Schools","Nat_Gas"]
["WINDFERNANNEX","Special Schools","Nat_Gas"]
["WINDFERNHS","Special Schools","Nat_Gas"]
["WOODARDES","Elementary Schools","Nat_Gas"]
["YEAGERES","Elementary Schools","Nat_Gas"]
["ANTHONYMS","Middle Schools","Fire"]
["BERRYCENTER","Administration","Fire"]
["BLEYLMS","Middle Schools","Fire"]
["CY-LAKESHS","High Schools","Fire"]
["CY-WOODSHS","High Schools","Fire"]
["DEANMS","Middle Schools","Fire"]
["EMERYES","Elementary Schools","Fire"]
["EMMOTTES","Elementary Schools","Fire"]
["FARNEYES","Elementary Schools","Fire"]
["GOODSONMS","Middle Schools","Fire"]
["HEMMENWAYES","Elementary Schools","Fire"]
["METCALFES","Elementary Schools","Fire"]
["MOOREES","Elementary Schools","Fire"]
["POSTMAES","Elementary Schools","Fire"]
["RENNELLES","Elementary Schools","Fire"]
["ROBINSONES","Elementary Schools","Fire"]
["ROBISONES","Elementary Schools","Fire"]
["SATELLITECOLDFOODWAREHOUSE","Administration","Fire"]
["SMITHMS","Middle Schools","Fire"]
["TRUITTMS","Middle Schools","Fire"]
["WARNERES","Elementary Schools","Fire"]
["ANTHONYMS","Middle Schools","Fire"]
["BERRYCENTER","Administration","Fire"]
["BLEYLMS","Middle Schools","Fire"]
["CY-LAKESHS","High Schools","Fire"]
["CY-WOODSHS","High Schools","Fire"]
["DEANMS","Middle Schools","Fire"]
["EMERYES","Elementary Schools","Fire"]
["EMMOTTES","Elementary Schools","Fire"]
["FARNEYES","Elementary Schools","Fire"]
["GOODSONMS","Middle Schools","Fire"]
["HEMMENWAYES","Elementary Schools","Fire"]
["METCALFES","Elementary Schools","Fire"]
["MOOREES","Elementary Schools","Fire"]
["POSTMAES","Elementary Schools","Fire"]
["RENNELLES","Elementary Schools","Fire"]
["ROBINSONES","Elementary Schools","Fire"]
["ROBISONES","Elementary Schools","Fire"]
["SATELLITECOLDFOODWAREHOUSE","Administration","Fire"]
["SMITHMS","Middle Schools","Fire"]
["TRUITTMS","Middle Schools","Fire"]
["WARNERES","Elementary Schools","Fire"]

{"sheet":"Sheet1","index":2,"n_rows":17,"n_cols":2,"rows_kept":17,"cut":false,"hidden":false,"merged":[]}
["School Type","High Schools"]
[]
["Row Labels"]
["BRIDGELANDHS"]
["CY-CREEKHS"]
["CY-FAIRHS"]
["CY-FALLSAGVOC"]
["CY-FALLSHS"]
["CY-LAKESHS"]
["CY-PARKHS"]
["CY-RANCHHS"]
["CY-RIDGEHS"]
["CY-SPRINGSHS"]
["CY-WOODSHS"]
["JERSEYVILLAGEHS"]
["LANGHAMCREEKHS"]
["Grand Total"]

{"sheet":"DataYY03","index":3,"n_rows":834,"n_cols":15,"rows_kept":834,"cut":false,"hidden":false,"merged":[]}
["School Type","Utility","Place","Location","Area","Eff. Date","kWhB","kWhC","Var [%]","Base Year 2","Cost","Var [%]3","Base Year 4","Current Year5","Var [%]6"]
[{"$f":"VLOOKUP(C2,Sheet3!$A$1:$C$821,2,FALSE)","v":"Elementary Schools"},"Electric","ADAM-ES","Houston, TX",103177,367,586800,603360,2.8220858895705501,44139.93,44980.85,1.9051230937611401,3211,2800,-12.799750856431]
[{"$f":"VLOOKUP(C3,Sheet3!$A$1:$C$821,2,FALSE)","v":"Special Schools"},"Electric","ALCABC","Houston, TX",56061,367,377472,367296,-2.6958290946083401,28698.65,26960.080000000002,-6.0580201507736398,2138,1641,-23.246024321796099]
[{"$f":"VLOOKUP(C4,Sheet3!$A$1:$C$821,2,FALSE)","v":"Special Schools"},"Electric","ALCWEST","Katy, TX",50839,367,276096,284352,2.99026425591099,20246.689999999999,19725.98,-2.5718277901227302,1396,1107,-20.702005730659]
[{"$f":"VLOOKUP(C5,Sheet3!$A$1:$C$821,2,FALSE)","v":"Elementary Schools"},"Electric","ANDREES","Cypress, TX",100156,43952,614784,585024,-4.8407245471580298,44097.53,42464.25,-3.70379021228627,2962,2562,-13.5043889264011]
[{"$f":"VLOOKUP(C6,Sheet3!$A$1:$C$821,2,FALSE)","v":"Middle Schools"},"Electric","ANTHONYMS","Cypress, TX",244123,367,1159110,1057285,-8.78475727066456,80346.559999999998,72921.05,-9.2418517980110195,6192,4563,-26.308139534883701]
[{"$f":"VLOOKUP(C7,Sheet3!$A$1:$C$821,2,FALSE)","v":"Middle Schools"},"Electric","ARAGONMS","Houston, TX",219821,367,1227534,1177837,-4.0485232995583003,82742.960000000006,88407.44,6.8458754678343601,5245,5239,-0.11439466158245901]
[{"$f":"VLOOKUP(C8,Sheet3!$A$1:$C$821,2,FALSE)","v":"Middle Schools"},"Electric","ARNOLDMS","Cypress, TX",210699,44409,1191084,1196777,0.477967968673914,71842.710000000006,71437.399999999994,-0.56416301667907598,3114,2921,-6.1978163134232496]
[{"$f":"VLOOKUP(C9,Sheet3!$A$1:$C$821,2,FALSE)","v":"Elementary Schools"},"Electric","AULTES","Cypress, TX",91912,43952,316416,314496,-0.60679611650485399,23266.2,23244.959999999999,-9.12912293369781E-2,1540,1420,-7.7922077922077904]
[{"$f":"VLOOKUP(C10,Sheet3!$A$1:$C$821,2,FALSE)","v":"Elementary Schools"},"Electric","BANEES","Houston, TX",106804,367,557568,552576,-0.895316804407714,42653.63,42195.91,-1.0731091351427799,2987,2597,-13.056578506863101]
[{"$f":"VLOOKUP(C11,Sheet3!$A$1:$C$821,2,FALSE)","v":"Elementary Schools"},"Electric","BANGES","Houston, TX",89313,44044,403488,423936,5.0678087080656704,29425.17,30746.36,4.4899995480060104,1875,1851,-1.28]
[{"$f":"VLOOKUP(C12,Sheet3!$A$1:$C$821,2,FALSE)","v":"Administration"},"Electric","BARKERTRANS","Houston, TX",22677,367,180480,177312,-1.7553191489361699,11490.05,11940.47,3.9200873799504801,650,645,-0.76923076923076905]
[{"$f":"VLOOKUP(C13,Sheet3!$A$1:$C$821,2,FALSE)","v":"Administration"},"Electric","BERRYCENTER","Cypress, TX",491434,367,2786626,2411171,-13.4734621725341,180277.45,172961,-4.0584388119534598,9574,9049,-5.4836014205138897]
[{"$f":"VLOOKUP(C14,Sheet3!$A$1:$C$821,2,FALSE)","v":"Elementary Schools"},"Electric","BIRKESES","Houston, TX",104952,44044,632640,749568,18.4825493171472,45891.69,53699.46,17.013472373756599,3200,3186,-0.4375]
[{"$f":"VLOOKUP(C15,Sheet3!$A$1:$C$821,2,FALSE)","v":"Elementary Schools"},"Electric","BLACKES","Cypress, TX",101992,44409,472320,513216,8.6585365853658498,36228.04,38611.4,6.5787715813496996,2668,2413,-9.5577211394302903]
[{"$f":"VLOOKUP(C16,Sheet3!$A$1:$C$821,2,FALSE)","v":"Middle Schools"},"Electric","BLEYLMS","Houston, TX",234294,44409,1037167,1101311,6.1845392304228701,70395.48,71691.429999999993,1.84095626594207,3735,3276,-12.289156626505999]
[{"$f":"VLOOKUP(C17,Sheet3!$A$1:$C$821,2,FALSE)","v":"Administration"},"Electric","BRADLEYPOLICESTATION","Cypress, TX",19680,43952,307488,308160,0.218545113955667,17471.54,18420.77,5.4330070503229804,767,813,5.9973924380704]
["Special Schools","Electric","BRAUTIGAMCENTER","Houston, TX",79751,44409,578412,458779,-20.6830079597242,36881.24,35566.199999999997,-3.5656067963007798,2478,2171,-12.389023405972599]
[{"$f":"VLOOKUP(C19,Sheet3!$A$1:$C$821,2,FALSE)","v":"High Schools"},"Electric","BRIDGELANDHS","Cypress, TX",579612,44409,2995677,2891054,-3.4924659768059101,203843.96,202046.44,-0.88181175444197601,14064,13083,-6.9752559726962504]
[{"$f":"VLOOKUP(C20,Sheet3!$A$1:$C$821,2,FALSE)","v":"Middle Schools"},"Electric","CAMPBELLMS","Houston, TX",232217,44409,1317375,1367529,3.8071164247082301,92839.38,88480.98,-4.6945595715955903,5786,4999,-13.601797442101599]
[{"$f":"VLOOKUP(C21,Sheet3!$A$1:$C$821,2,FALSE)","v":"Administration"},"Electric","CFISDNATATORIUM","Houston, TX",49471,367,2046640,1371504,-32.98753078216,119082.18,94225.93,-20.873190262388501,4768,3910,-17.994966442953]
[{"$f":"VLOOKUP(C22,Sheet3!$A$1:$C$821,2,FALSE)","v":"Middle Schools"},"Electric","COOKMS","Houston, TX",205797,43952,1110051,1038035,-6.4876298476376304,73646.02,70245.240000000005,-4.6177376591430201,3959,4409,11.3665066936095]
[{"$f":"VLOOKUP(C23,Sheet3!$A$1:$C$821,2,FALSE)","v":"Elementary Schools"},"Electric","COPELANDES","Houston, TX",91324,44409,492480,513792,4.3274853801169604,38578.19,39904.81,3.4387823793703101,2972,2605,-12.348586810228801]
[{"$f":"VLOOKUP(C24,Sheet3!$A$1:$C$821,2,FALSE)","v":"High Schools"},"Electric","CY-CREEKHS","Houston, TX",528099,44409,3250592,2810249,-13.5465478288263,200486.28,189060.54,-5.6990134187735899,12235,8949,-26.857376379239899]
[{"$f":"VLOOKUP(C25,Sheet3!$A$1:$C$821,2,FALSE)","v":"Administration"},"Electric","CY-FAIRCOMPLEXRETENTIONPOND","Cypress, TX",0,367,460,1044,126.95652173913,426.99,691.73,62.001452024637601,45,80,77.7777777777778]
[{"$f":"VLOOKUP(C26,Sheet3!$A$1:$C$821,2,FALSE)","v":"High Schools"},"Electric","CY-FAIRHS","Cypress, TX",507380,44409,4017425,3801349,-5.3784700398887297,231342.9,239781.77,3.64777566115061,11961,11614,-2.9010952261516598]
[{"$f":"VLOOKUP(C27,Sheet3!$A$1:$C$821,2,FALSE)","v":"Administration"},"Electric","CY-FAIRHS-BALLFIELD","Cypress, TX",0,367,15168,16896,11.3924050632911,7291.79,4579.47,-37.196902269538803,929,504,-45.748116254036603]
[{"$f":"VLOOKUP(C28,Sheet3!$A$1:$C$821,2,FALSE)","v":"High Schools"},"Electric","CY-FALLSHS","Houston, TX",565245,44409,2456496,2435884,-0.83908135816219498,163479.20000000001,163322.51999999999,-9.58409387860963E-2,8758,7813,-10.790134733957499]
[{"$f":"VLOOKUP(C29,Sheet3!$A$1:$C$821,2,FALSE)","v":"High Schools"},"Electric","CY-LAKESHS","Katy, TX",514068,43952,3177900,3259515,2.5682054186727101,198831.52,198233.01,-0.30101364210261999,11798,9898,-16.1044244787252]
[{"$f":"VLOOKUP(C30,Sheet3!$A$1:$C$821,2,FALSE)","v":"High Schools"},"Electric","CY-PARKHS","Cypress, TX",764731,367,3187777,4272948,34.041622108447399,227243.69,286478.76,26.066761193677099,16767,16895,0.76340430607741405]
[{"$f":"VLOOKUP(C31,Sheet3!$A$1:$C$821,2,FALSE)","v":"High Schools"},"Electric","CY-RANCHHS","Cypress, TX",527481,44409,3683221,3785028,2.76407524826775,269406.75,271798.14,0.88765036510777895,20626,18841,-8.6541258605643403]
[{"$f":"VLOOKUP(C32,Sheet3!$A$1:$C$821,2,FALSE)","v":"High Schools"},"Electric","CY-RIDGEHS","Houston, TX",502564,44044,2792075,2795312,0.115935281108136,171454.93,182059.84,6.1852464668120097,9486,10187,7.3898376554923004]
[{"$f":"VLOOKUP(C33,Sheet3!$A$1:$C$821,2,FALSE)","v":"High Schools"},"Electric","CY-SPRINGSHS","Cypress, TX",478615,44044,2874424,2692359,-6.3339646482217002,183496.8,168961.57,-7.9212444031721496,9628,9477,-1.5683423348566701]
[{"$f":"VLOOKUP(C34,Sheet3!$A$1:$C$821,2,FALSE)","v":"High Schools"},"Electric","CY-WOODSHS","Cypress, TX",501009,44044,1774633,1657208,-6.6168610636678098,110586.71,108774.51,-1.6387140914129701,6335,5785,-8.6819258089976294]
[{"$f":"VLOOKUP(C35,Sheet3!$A$1:$C$821,2,FALSE)","v":"Elementary Schools"},"Electric","DANISHES","Houston, TX",98052,43952,598649,634915,6.0579738711665803,42925.9,47911.91,11.615388378578,2512,2458,-2.1496815286624198]
[{"$f":"VLOOKUP(C36,Sheet3!$A$1:$C$821,2,FALSE)","v":"Middle Schools"},"Electric","DEANMS","Houston, TX",222788,44044,1225078,1344727,9.7666434300509799,85448.99,94041.04,10.055180289433499,5424,4936,-8.9970501474926294]
[{"$f":"VLOOKUP(C37,Sheet3!$A$1:$C$821,2,FALSE)","v":"Elementary Schools"},"Electric","DURYEAES","Katy, TX",96423,43952,442944,459840,3.81447767663632,35506.15,36804.449999999997,3.6565496399919399,2684,2456,-8.49478390461997]
[{"$f":"VLOOKUP(C38,Sheet3!$A$1:$C$821,2,FALSE)","v":"Administration"},"Electric","ELC1","Houston, TX",6832,367,40120,32080,-20.039880358923199,3269.47,2907.26,-11.078554016400201,231,211,-8.6580086580086597]
[{"$f":"VLOOKUP(C39,Sheet3!$A$1:$C$821,2,FALSE)","v":"Administration"},"Electric","ELC2","Houston, TX",4573,367,27199,27967,2.8236332218096298,2494.94,2581.33,3.4626083192381398,178,187,5.0561797752809001]
[{"$f":"VLOOKUP(C40,Sheet3!$A$1:$C$821,2,FALSE)","v":"Administration"},"Electric","ELDRIDGETRANS","Houston, TX",19256,44044,396096,394752,-0.33931168201648099,23550.51,24102.16,2.3424121176144399,1169,1103,-5.6458511548331902]
[{"$f":"VLOOKUP(C41,Sheet3!$A$1:$C$821,2,FALSE)","v":"Elementary Schools"},"Electric","EMERYES","Katy, TX",98438,44044,455040,483080,6.1620956399437397,36283.24,36743.4,1.2682439605724301,2801,2324,-17.029632274187801]
[{"$f":"VLOOKUP(C42,Sheet3!$A$1:$C$821,2,FALSE)","v":"Elementary Schools"},"Electric","EMMOTTES","Houston, TX",77394,43952,356736,369792,3.65984930032293,29315.34,29820.98,1.72483075413759,2287,2003,-12.418014866637501]
[{"$f":"VLOOKUP(C43,Sheet3!$A$1:$C$821,2,FALSE)","v":"Administration"},"Electric","EXHIBITCENTERSCIENCERESOURCEC","Cypress, TX",72198,367,499360,409600,-17.975008010253099,30402.54,27059.119999999999,-10.9971732624971,1609,1432,-11.000621504039801]
[{"$f":"VLOOKUP(C44,Sheet3!$A$1:$C$821,2,FALSE)","v":"Administration"},"Electric","EXHIBITCENTERTELGEAG","Cypress, TX",33198,367,185955,178987,-3.7471431260251098,10245.790000000001,9823.15,-4.12501134612363,408,350,-14.2156862745098]
[{"$f":"VLOOKUP(C45,Sheet3!$A$1:$C$821,2,FALSE)","v":"Administration"},"Electric","FALCONCOMPLEX","Houston, TX",0,367,427584,424512,-0.71845532105972199,25380.39,26016.35,2.5057140571913998,1257,1209,-3.8186157517899799]
[{"$f":"VLOOKUP(C46,Sheet3!$A$1:$C$821,2,FALSE)","v":"Elementary Schools"},"Electric","FARNEYES","Cypress, TX",95036,367,561120,626400,11.633875106929001,41921.69,48850.8,16.528699105403401,3059,3196,4.4785877737822801]
[{"$f":"VLOOKUP(C47,Sheet3!$A$1:$C$821,2,FALSE)","v":"Elementary Schools"},"Electric","FIESTES","Houston, TX",91621,367,424800,424512,-6.7796610169491497E-2,30510.78,30965.07,1.48894915174243,1998,1878,-6.0060060060060101]
[{"$f":"VLOOKUP(C48,Sheet3!$A$1:$C$821,2,FALSE)","v":"Administration"},"Electric","FOODPRODUCTIONCENTER","Houston, TX",57684,367,2019386,1989674,-1.4713383176866599,122317.44,116656.67,-4.62793367814107,4268,4051,-5.0843486410496697]
[{"$f":"VLOOKUP(C49,Sheet3!$A$1:$C$821,2,FALSE)","v":"Administration"},"Electric","FOODSERVICEWAREHOUSE","Houston, TX",48487,43952,419136,382272,-8.7952359138799796,24648.02,23601.18,-4.24715656673437,1176,1112,-5.4421768707483]
[{"$f":"VLOOKUP(C50,Sheet3!$A$1:$C$821,2,FALSE)","v":"Elementary Schools"},"Electric","FRANCONEES","Houston, TX",90518,367,483224,496704,2.7895965432180501,36757.18,38327.760000000002,4.2728522699510698,2673,2485,-7.0332959221848101]
[{"$f":"VLOOKUP(C51,Sheet3!$A$1:$C$821,2,FALSE)","v":"Elementary Schools"},"Electric","FRAZIERES","Houston, TX",85844,367,541551,615558,13.6657489322335,40246.57,46020.42,14.346191489113201,2523,2677,6.10384462940943]
[{"$f":"VLOOKUP(C52,Sheet3!$A$1:$C$821,2,FALSE)","v":"Elementary Schools"},"Electric","GLEASONES","Houston, TX",91424,367,570816,695520,21.846619576185699,39997.61,47226,18.0720548052746,2684,2600,-3.12965722801788]
[{"$f":"VLOOKUP(C53,Sheet3!$A$1:$C$821,2,FALSE)","v":"Middle Schools"},"Electric","GOODSONMS","Cypress, TX",218801,367,1028307,1066241,3.6889761520635398,70203.42,72030.899999999994,2.6031210445303099,4728,4015,-15.080372250423]
[{"$f":"VLOOKUP(C54,Sheet3!$A$1:$C$821,2,FALSE)","v":"Elementary Schools"},"Electric","HAIRGROVEES","Houston, TX",85052,367,503040,528384,5.0381679389313003,36779.99,37563.71,2.1308325532443,2576,2189,-15.0232919254658]
[{"$f":"VLOOKUP(C55,Sheet3!$A$1:$C$821,2,FALSE)","v":"Elementary Schools"},"Electric","HAMILTONES","Cypress, TX",89692,44044,368928,389664,5.6206088992974204,28246.26,29657.81,4.9972987574284202,2018,1875,-7.0862239841427197]
[{"$f":"VLOOKUP(C56,Sheet3!$A$1:$C$821,2,FALSE)","v":"Middle Schools"},"Electric","HAMILTONMS","Cypress, TX",194726,44044,1490212,1154623,-22.519547554307699,90163.31,74588.800000000003,-17.273667082541699,4647,3486,-24.983860555196902]
[{"$f":"VLOOKUP(C57,Sheet3!$A$1:$C$821,2,FALSE)","v":"Elementary Schools"},"Electric","HANCOCKES","Houston, TX",88795,367,514080,504288,-1.9047619047619,39713.339999999997,39670.15,-0.10875438832392301,2909,2624,-9.7971811619113094]
[{"$f":"VLOOKUP(C58,Sheet3!$A$1:$C$821,2,FALSE)","v":"Elementary Schools"},"Electric","HEMMENWAYES","Katy, TX",101091,44044,443904,526464,18.598615916955001,38620.03,42718.3,10.611773217162201,3224,2892,-10.297766749379701]
[{"$f":"VLOOKUP(C59,Sheet3!$A$1:$C$821,2,FALSE)","v":"Elementary Schools"},"Electric","HOLBROOKES","Houston, TX",99937,367,572352,625344,9.2586380409258595,44091.99,45306.66,2.75485411295793,3169,2602,-17.892079520353398]
[{"$f":"VLOOKUP(C60,Sheet3!$A$1:$C$821,2,FALSE)","v":"Elementary Schools"},"Electric","HOLMSLEYES","Houston, TX",81704,44044,343296,361536,5.3131991051454097,26409.32,28446.880000000001,7.7153065660153297,1867,1882,0.80342795929298305]
[{"$f":"VLOOKUP(C61,Sheet3!$A$1:$C$821,2,FALSE)","v":"Elementary Schools"},"Electric","HOOVERES","Katy, TX",112519,367,419760,486720,15.951972555746099,34086.99,36565.230000000003,7.2703397982632101,2564,2264,-11.7004680187207]
[{"$f":"VLOOKUP(C62,Sheet3!$A$1:$C$821,2,FALSE)","v":"Middle Schools"},"Electric","HOPPERMS","Cypress, TX",226178,367,1198744,1246703,4.0007708067777603,85451.96,84752.71,-0.81829603440342402,5196,4632,-10.8545034642032]
[{"$f":"VLOOKUP(C63,Sheet3!$A$1:$C$821,2,FALSE)","v":"Elementary Schools"},"Electric","HORNEES","Houston, TX",87881,367,506304,562752,11.1490329920364,36701.019999999997,40558.69,10.511070264532201,2501,2408,-3.7185125949620201]
[{"$f":"VLOOKUP(C64,Sheet3!$A$1:$C$821,2,FALSE)","v":"Administration"},"Electric","ISCA","Houston, TX",132467,367,341520,350640,2.6704146170063199,23710.080000000002,24931.29,5.1505941776662096,1524,1464,-3.9370078740157499]
[{"$f":"VLOOKUP(C65,Sheet3!$A$1:$C$821,2,FALSE)","v":"Administration"},"Electric","ISCB","Houston, TX",0,367,308480,332080,7.65041493775934,20275.59,22524.26,11.090528068480401,1208,1238,2.4834437086092702]
[{"$f":"VLOOKUP(C66,Sheet3!$A$1:$C$821,2,FALSE)","v":"Administration"},"Electric","ISCC","Houston, TX",0,367,526960,558240,5.9359344162744803,32596.16,35627.33,9.2991628461757507,1751,1785,1.94174757281553]
[{"$f":"VLOOKUP(C67,Sheet3!$A$1:$C$821,2,FALSE)","v":"Administration"},"Electric","ISCC-EXLIGHT","Houston, TX",0,367,3660,3660,0,564.21,451.23,-20.024458978040101,0,0,0]
[{"$f":"VLOOKUP(C68,Sheet3!$A$1:$C$821,2,FALSE)","v":"Administration"},"Electric","ISCD","Houston, TX",0,367,15480,15800,2.0671834625323,1502.84,1537.02,2.2743605440366199,117,114,-2.5641025641025599]
[{"$f":"VLOOKUP(C69,Sheet3!$A$1:$C$821,2,FALSE)","v":"Administration"},"Electric","ISCDATACENTER","Houston, TX",0,367,117288,147469,25.7323852397517,6338.8,7629.73,20.365526598094299,186,224,20.430107526881699]
[{"$f":"VLOOKUP(C70,Sheet3!$A$1:$C$821,2,FALSE)","v":"Administration"},"Electric","ISCSW","Houston, TX",0,367,44153,39892,-9.6505333725907594,2902.35,2705.18,-6.7934604716867399,158,141,-10.7594936708861]
[{"$f":"VLOOKUP(C71,Sheet3!$A$1:$C$821,2,FALSE)","v":"Administration"},"Electric","ISCW","Houston, TX",35364,367,309504,355584,14.8883374689826,21899.45,25618.02,16.980198132829798,1467,1528,4.15814587593729]
[{"$f":"VLOOKUP(C72,Sheet3!$A$1:$C$821,2,FALSE)","v":"Administration"},"Electric","JARVISCENTRALPLANT","Cypress, TX",12152,367,1750520,2088742,19.3212302630076,136782.45000000001,155374.79999999999,13.5926429158127,13128,10517,-19.888787324801999]
[{"$f":"VLOOKUP(C73,Sheet3!$A$1:$C$821,2,FALSE)","v":"High Schools"},"Electric","JERSEYVILLAGEHS","Houston, TX",513473,43952,2683551,2733388,1.8571288565039401,180223.04,184182.73,2.19710532016328,11426,10003,-12.454052161736399]
[{"$f":"VLOOKUP(C74,Sheet3!$A$1:$C$821,2,FALSE)","v":"Administration"},"Electric","JERSEYVILLAGESTADIUM","Houston, TX",2385,367,23040,13068,-43.28125,4605.88,1156.24,-74.896436728703307,568,1305,129.753521126761]
[{"$f":"VLOOKUP(C75,Sheet3!$A$1:$C$821,2,FALSE)","v":"Elementary Schools"},"Electric","JOWELLES","Katy, TX",73726,367,308736,322176,4.3532338308457703,27059.96,27394.79,1.23736324813488,2096,1936,-7.6335877862595396]
[{"$f":"VLOOKUP(C76,Sheet3!$A$1:$C$821,2,FALSE)","v":"Middle Schools"},"Electric","KAHLAMS","Houston, TX",221601,367,1224164,1290523,5.4207606170415099,88478.56,97539.98,10.2413737294097,5993,5258,-12.264308359753]
[{"$f":"VLOOKUP(C77,Sheet3!$A$1:$C$821,2,FALSE)","v":"Elementary Schools"},"Electric","KEITHES","Cypress, TX",95518,367,448320,483456,7.8372591006423997,34815.22,37267.94,7.0449648171115999,2515,2393,-4.8508946322067601]
[{"$f":"VLOOKUP(C78,Sheet3!$A$1:$C$821,2,FALSE)","v":"Elementary Schools"},"Electric","KIRKES","Houston, TX",93897,367,567648,603360,6.2912227295788901,43363.09,45466.75,4.85126867112099,3211,2845,-11.3983182809094]
[{"$f":"VLOOKUP(C79,Sheet3!$A$1:$C$821,2,FALSE)","v":"Middle Schools"},"Electric","LABAYMS","Houston, TX",190510,43952,1176724,871108,-25.971765681672199,72560.59,61169.35,-15.6989351933329,3470,3675,5.9077809798270904]
[{"$f":"VLOOKUP(C80,Sheet3!$A$1:$C$821,2,FALSE)","v":"Elementary Schools"},"Electric","LAMKINES","Cypress, TX",113622,43956,475920,479520,0.75642965204236001,35650.06,36337.75,1.9290009610082,2526,2310,-8.5510688836104496]
[{"$f":"VLOOKUP(C81,Sheet3!$A$1:$C$821,2,FALSE)","v":"High Schools"},"Electric","LANGHAMCREEKHS","Houston, TX",535686,367,2104786,1990916,-5.4100511881017797,135608.87,133167.01999999999,-1.8006565499734599,7950,8130,2.2641509433962299]
[{"$f":"VLOOKUP(C82,Sheet3!$A$1:$C$821,2,FALSE)","v":"Administration"},"Electric","LANGHAMCREEKRETENTIONPOND","Houston, TX",0,367,1536,1920,25,1431.22,1663.68,16.2420871703861,153,205,33.986928104575199]
[{"$f":"VLOOKUP(C83,Sheet3!$A$1:$C$821,2,FALSE)","v":"Elementary Schools"},"Electric","LEEES","Houston, TX",95352,367,677184,589056,-13.013892826765,45100.85,43477.4,-3.5995995640880398,2779,2659,-4.3181000359841697]
[{"$f":"VLOOKUP(C84,Sheet3!$A$1:$C$821,2,FALSE)","v":"Elementary Schools"},"Electric","LIEDERES","Houston, TX",88406,367,452448,455904,0.76384468491406798,34521.160000000003,35792.370000000003,3.68240812301788,2410,2344,-2.73858921161826]
[{"$f":"VLOOKUP(C85,Sheet3!$A$1:$C$821,2,FALSE)","v":"Elementary Schools"},"Electric","LOWERYES","Houston, TX",78614,43956,471552,557184,18.1596091205212,38992.080000000002,41134.36,5.4941413743508898,3134,2533,-19.176770899808499]
[{"$f":"VLOOKUP(C86,Sheet3!$A$1:$C$821,2,FALSE)","v":"Administration"},"Electric","MAINTENANCEOPER","Houston, TX",36679,43952,528000,450048,-14.763636363636399,32869.65,28937.47,-11.9629506246644,1797,1462,-18.642181413466901]
[{"$f":"VLOOKUP(C87,Sheet3!$A$1:$C$821,2,FALSE)","v":"Elementary Schools"},"Electric","MATZKEMILLSES","Houston, TX",124682,43466,504384,511488,1.40845070422535,35693.06,35388.36,-0.85366735158039098,2271,2004,-11.756935270805799]
[{"$f":"VLOOKUP(C88,Sheet3!$A$1:$C$821,2,FALSE)","v":"Elementary Schools"},"Electric","MCFEEES","Katy, TX",105539,367,555276,534279,-3.7813627817517799,42796.02,39665.56,-7.3148390901770801,2404,2083,-13.352745424292801]
[{"$f":"VLOOKUP(C89,Sheet3!$A$1:$C$821,2,FALSE)","v":"Elementary Schools"},"Electric","METCALFES","Houston, TX",85120,43956,374688,384192,2.5365103766333599,30109.35,31618.26,5.0114333255284498,2302,2201,-4.3874891398783697]
[{"$f":"VLOOKUP(C90,Sheet3!$A$1:$C$821,2,FALSE)","v":"Elementary Schools"},"Electric","MILLSAPES","Cypress, TX",77324,367,414528,421824,1.7600741083835101,32897.79,33365.03,1.4202777754979901,2502,2219,-11.3109512390088]
[{"$f":"VLOOKUP(C91,Sheet3!$A$1:$C$821,2,FALSE)","v":"Administration"},"Electric","MILLSAPNATURETRAIL","Cypress, TX",1121,367,1074,2132,98.510242085661105,106.86,166.91,56.195021523488698,9,10,11.1111111111111]
[{"$f":"VLOOKUP(C92,Sheet3!$A$1:$C$821,2,FALSE)","v":"Administration"},"Electric","MILLSAPROPES","Cypress, TX",924,367,2482,2494,0.48348106365833998,199.38,190.28,-4.5641488614705601,10,8,-20]
[{"$f":"VLOOKUP(C93,Sheet3!$A$1:$C$821,2,FALSE)","v":"Elementary Schools"},"Electric","MOOREES","Houston, TX",83063,43952,336384,344448,2.3972602739725999,26006.58,25486.74,-1.9988787453021499,1764,1560,-11.5646258503401]
[{"$f":"VLOOKUP(C94,Sheet3!$A$1:$C$821,2,FALSE)","v":"Elementary Schools"},"Electric","OWENSES","Houston, TX",85590,43952,473088,541056,14.3668831168831,37693.83,42261.96,12.1190391106449,2864,2752,-3.91061452513966]
[{"$f":"VLOOKUP(C95,Sheet3!$A$1:$C$821,2,FALSE)","v":"Elementary Schools"},"Electric","POPEES","Cypress, TX",112970,367,476352,491136,3.1035872632003199,32939.11,35717.769999999997,8.43574704963188,2151,2138,-0.60437006043700603]
[{"$f":"VLOOKUP(C96,Sheet3!$A$1:$C$821,2,FALSE)","v":"Elementary Schools"},"Electric","POSTES","Houston, TX",104852,367,526656,705216,33.904484141451,40533.42,49182.09,21.337133654155,2889,2747,-4.9151955694011802]
[{"$f":"VLOOKUP(C97,Sheet3!$A$1:$C$821,2,FALSE)","v":"Elementary Schools"},"Electric","POSTMAES","Cypress, TX",98920,367,500544,523776,4.6413502109704599,37563.379999999997,39253.339999999997,4.4989561642216396,2736,2465,-9.9049707602339208]
[{"$f":"VLOOKUP(C98,Sheet3!$A$1:$C$821,2,FALSE)","v":"Administration"},"Electric","PRIDGEONSTADIUM","Houston, TX",86181,367,405216,394848,-2.5586353944562901,28383.51,28700.09,1.1153659290200499,1719,1719,0]
[{"$f":"VLOOKUP(C99,Sheet3!$A$1:$C$821,2,FALSE)","v":"Administration"},"Electric","RECYCLECENTER","Houston, TX",0,367,8160,4712,-42.254901960784302,909.85,819.49,-9.9313073583557703,73,77,5.4794520547945202]
[{"$f":"VLOOKUP(C100,Sheet3!$A$1:$C$821,2,FALSE)","v":"Elementary Schools"},"Electric","REEDES","Houston, TX",90012,367,427392,463488,8.4456424079065595,33713.24,37091.800000000003,10.0214633775929,2491,2500,0.36130068245684499]
[{"$f":"VLOOKUP(C101,Sheet3!$A$1:$C$821,2,FALSE)","v":"Elementary Schools"},"Electric","RENNELLES","Cypress, TX",113621,43678,288532,316928,9.8415427058350495,18862.169999999998,20645.62,9.4551687319115505,1128,1042,-7.6241134751773103]
[{"$f":"VLOOKUP(C102,Sheet3!$A$1:$C$821,2,FALSE)","v":"Elementary Schools"},"Electric","ROBINSONES","Katy, TX",98532,43956,458496,497664,8.5427135678392006,36700.089999999997,38413.07,4.6675089897599698,2772,2469,-10.930735930735899]
[{"$f":"VLOOKUP(C103,Sheet3!$A$1:$C$821,2,FALSE)","v":"Elementary Schools"},"Electric","ROBISONES","Cypress, TX",93882,43952,373440,368160,-1.4138817480719801,23757.62,24577.23,3.4498826060859602,1339,1315,-1.7923823749066501]
[{"$f":"VLOOKUP(C104,Sheet3!$A$1:$C$821,2,FALSE)","v":"Middle Schools"},"Electric","SALYARDSMS","Cypress, TX",242116,43952,1163277,1062826,-8.6351745972799296,78893.56,73906.64,-6.3210736085429504,5809,4645,-20.037872267171601]
[{"$f":"VLOOKUP(C105,Sheet3!$A$1:$C$821,2,FALSE)","v":"Elementary Schools"},"Electric","SAMPSONES","Cypress, TX",96096,367,520128,544608,4.7065337763012201,40276.99,43699.72,8.4979786225336102,2992,2946,-1.5374331550802101]
[{"$f":"VLOOKUP(C106,Sheet3!$A$1:$C$821,2,FALSE)","v":"Administration"},"Electric","SATELLITECOLDFOODWAREHOUSE","Cypress, TX",22020,367,805440,781056,-3.0274135876042898,44933.93,44211.09,-1.6086730005588199,1907,1739,-8.8096486628211803]
[{"$f":"VLOOKUP(C107,Sheet3!$A$1:$C$821,2,FALSE)","v":"Elementary Schools"},"Electric","SHERIDANES","Katy, TX",92874,44044,565248,537600,-4.8913043478260896,42211.72,42132.14,-0.18852584069069001,3033,2754,-9.1988130563798194]
[{"$f":"VLOOKUP(C108,Sheet3!$A$1:$C$821,2,FALSE)","v":"Middle Schools"},"Electric","SMITHMS","Cypress, TX",233159,44044,745920,702720,-5.7915057915057897,49484.33,48320.02,-2.3528862571242199,2938,2687,-8.5432266848196008]
[{"$f":"VLOOKUP(C109,Sheet3!$A$1:$C$821,2,FALSE)","v":"Middle Schools"},"Electric","SPILLANEMS","Cypress, TX",235889,367,979263,1021719,4.3355053749605599,61976.19,63128.87,1.8598755425269,2978,2946,-1.0745466756212201]
[{"$f":"VLOOKUP(C110,Sheet3!$A$1:$C$821,2,FALSE)","v":"Elementary Schools"},"Electric","SWENKEES","Cypress, TX",107914,367,533520,541440,1.48448043184885,38831.339999999997,42371.47,9.1166825558942897,2700,2758,2.1481481481481501]
[{"$f":"VLOOKUP(C111,Sheet3!$A$1:$C$821,2,FALSE)","v":"Administration"},"Electric","TELGETRANS","Cypress, TX",19649,367,182480,187640,2.8277071459886001,11508.22,12416.18,7.8896649525295803,636,652,2.5157232704402501]
[{"$f":"VLOOKUP(C112,Sheet3!$A$1:$C$821,2,FALSE)","v":"Middle Schools"},"Electric","THORNTONMS","Katy, TX",202739,44044,1107752,1023568,-7.5995349139518602,73035.39,69182.539999999994,-5.2753192664542503,4548,4230,-6.9920844327176797]
[{"$f":"VLOOKUP(C113,Sheet3!$A$1:$C$821,2,FALSE)","v":"Elementary Schools"},"Electric","TIPPSES","Houston, TX",101727,367,566295,618131,9.1535330525609506,41981.24,44580.28,6.1909557697676396,2497,2502,0.20024028834601501]
[{"$f":"VLOOKUP(C114,Sheet3!$A$1:$C$821,2,FALSE)","v":"Middle Schools"},"Electric","TRUITTMS","Houston, TX",209274,43952,946205,855366,-9.6003508753388491,62032.07,57077.57,-7.9869976932899398,3849,3460,-10.106521174331]
[{"$f":"VLOOKUP(C115,Sheet3!$A$1:$C$821,2,FALSE)","v":"Elementary Schools"},"Electric","WALKERES","Katy, TX",98321,367,680381,565284,-16.9165511676546,46303.040000000001,45171.95,-2.4427985721887802,2447,2477,1.2259910093992601]
[{"$f":"VLOOKUP(C116,Sheet3!$A$1:$C$821,2,FALSE)","v":"Elementary Schools"},"Electric","WARNERES","Cypress, TX",98451,44044,315706,362492,14.819483950257499,21566.29,23415.66,8.5752811447866097,1202,1264,5.1580698835274497]
[{"$f":"VLOOKUP(C117,Sheet3!$A$1:$C$821,2,FALSE)","v":"Middle Schools"},"Electric","WATKINSMS","Houston, TX",220237,44044,1041630,1080092,3.69248197536553,69686.990000000005,71847.039999999994,3.0996460027904802,4328,3700,-14.5101663585952]
[{"$f":"VLOOKUP(C118,Sheet3!$A$1:$C$821,2,FALSE)","v":"Elementary Schools"},"Electric","WELLSES","Cypress, TX",124414,44044,551040,587520,6.6202090592334502,41666.199999999997,43911.45,5.3886603529959496,2919,2727,-6.5775950668037]
[{"$f":"VLOOKUP(C119,Sheet3!$A$1:$C$821,2,FALSE)","v":"Administration"},"Electric","WESTGREENAGSCIENCECENTER","Cypress, TX",20124,367,59904,41664,-30.448717948717899,3848.1,2699.72,-29.842779553545899,206,131,-36.4077669902913]
[{"$f":"VLOOKUP(C120,Sheet3!$A$1:$C$821,2,FALSE)","v":"Administration"},"Electric","WESTGREENTRANS","Cypress, TX",45340,367,269568,273408,1.42450142450142,16697.72,17330.099999999999,3.78722364490481,885,847,-4.2937853107344601]
[{"$f":"VLOOKUP(C121,Sheet3!$A$1:$C$821,2,FALSE)","v":"Elementary Schools"},"Electric","WILLBERNES","Houston, TX",89993,367,449568,434304,-3.3952594490711099,32181.53,33011.050000000003,2.5776276019194899,2134,2102,-1.4995313964386101]
[{"$f":"VLOOKUP(C122,Sheet3!$A$1:$C$821,2,FALSE)","v":"Elementary Schools"},"Electric","WILSONES","Houston, TX",84992,367,467328,499968,6.9843878389482299,36525.440000000002,36318.06,-0.56776865658565601,2781,2168,-22.0424307802949]
[{"$f":"VLOOKUP(C123,Sheet3!$A$1:$C$821,2,FALSE)","v":"Special Schools"},"Electric","WINDFERNANNEX","Houston, TX",59400,43952,405888,379312,-6.5476190476190501,27058.44,25156.73,-7.0281583121569504,1665,1459,-12.3723723723724]
[{"$f":"VLOOKUP(C124,Sheet3!$A$1:$C$821,2,FALSE)","v":"Special Schools"},"Electric","WINDFERNHS","Houston, TX",50022,367,297590,340608,14.455458852784,23818.6,26674.560000000001,11.990461236176801,1851,1753,-5.2944354403025402]
[{"$f":"VLOOKUP(C125,Sheet3!$A$1:$C$821,2,FALSE)","v":"Elementary Schools"},"Electric","WOODARDES","Cypress, TX",116974,44044,525600,541440,3.0136986301369899,41248.910000000003,40704.92,-1.3187984846145,2981,2543,-14.6930560214693]
[{"$f":"VLOOKUP(C126,Sheet3!$A$1:$C$821,2,FALSE)","v":"Elementary Schools"},"Electric","YEAGERES","Houston, TX",81794,367,483840,473184,-2.2023809523809499,38138.120000000003,35326.019999999997,-7.37346256186723,2904,2202,-24.1735537190083]
[{"$f":"VLOOKUP(C127,Sheet3!$A$1:$C$821,2,FALSE)","v":"Elementary Schools"},"Electric","ADAM-ES","Houston, TX",103177,367,379440,467280,23.1499051233397,33544.400000000001,37007.89,10.325091520492199,2606,2167,-16.845740598618601]
[{"$f":"VLOOKUP(C128,Sheet3!$A$1:$C$821,2,FALSE)","v":"Special Schools"},"Electric","ALCABC","Houston, TX",56061,367,255936,281088,9.8274568642160496,21217.16,25424.87,19.8316362793135,1670,1735,3.8922155688622802]
[{"$f":"VLOOKUP(C129,Sheet3!$A$1:$C$821,2,FALSE)","v":"Special Schools"},"Electric","ALCWEST","Katy, TX",50839,367,297792,316992,6.4474532559638904,18878.05,21588.67,14.358580467792001,975,1055,8.2051282051282097]
[{"$f":"VLOOKUP(C130,Sheet3!$A$1:$C$821,2,FALSE)","v":"Elementary Schools"},"Electric","ANDREES","Cypress, TX",100156,43952,420288,504384,20.009136592051199,34583.57,37878.239999999998,9.5266914317983904,2480,2118,-14.5967741935484]
[{"$f":"VLOOKUP(C131,Sheet3!$A$1:$C$821,2,FALSE)","v":"Middle Schools"},"Electric","ANTHONYMS","Cypress, TX",244123,367,741226,922344,24.434922682150901,61221.65,67961.440000000002,11.0088342930973,4444,4044,-9.0009000900090008]
[{"$f":"VLOOKUP(C132,Sheet3!$A$1:$C$821,2,FALSE)","v":"Middle Schools"},"Electric","ARAGONMS","Houston, TX",219821,367,817126,1064937,30.327146608968501,68270.3,85767,25.628567620180402,4606,4833,4.9283543204515796]
[{"$f":"VLOOKUP(C133,Sheet3!$A$1:$C$821,2,FALSE)","v":"Middle Schools"},"Electric","ARNOLDMS","Cypress, TX",210699,44409,985104,1135255,15.242147022040299,60300.36,75958.34,25.966644311907899,2779,2993,7.7006117308384301]
[{"$f":"VLOOKUP(C134,Sheet3!$A$1:$C$821,2,FALSE)","v":"Elementary Schools"},"Electric","AULTES","Cypress, TX",91912,43952,228096,274560,20.370370370370399,19698.259999999998,22938.99,16.4518591997466,1455,1431,-1.6494845360824699]
[{"$f":"VLOOKUP(C135,Sheet3!$A$1:$C$821,2,FALSE)","v":"Elementary Schools"},"Electric","BANEES","Houston, TX",106804,367,388032,504192,29.9356754082138,32924.47,40925.17,24.300163373928299,2365,2371,0.25369978858351]
[{"$f":"VLOOKUP(C136,Sheet3!$A$1:$C$821,2,FALSE)","v":"Elementary Schools"},"Electric","BANGES","Houston, TX",89313,44044,279360,387936,38.865979381443303,22990.81,30397.63,32.2164377853586,1650,1754,6.3030303030303001]
[{"$f":"VLOOKUP(C137,Sheet3!$A$1:$C$821,2,FALSE)","v":"Administration"},"Electric","BARKERTRANS","Houston, TX",22677,367,133536,151584,13.5154565061107,9216.69,11216.04,21.692711808686202,563,612,8.7033747779751298]
[{"$f":"VLOOKUP(C138,Sheet3!$A$1:$C$821,2,FALSE)","v":"Administration"},"Electric","BERRYCENTER","Cypress, TX",491434,367,2059197,2164301,5.1041255401984396,150915.95000000001,157060.07,4.07121977498071,6960,7288,4.7126436781609202]
[{"$f":"VLOOKUP(C139,Sheet3!$A$1:$C$821,2,FALSE)","v":"Elementary Schools"},"Electric","BIRKESES","Houston, TX",104952,44044,489408,701376,43.311102393095297,38130.879999999997,53581.3,40.519442509588004,2665,3032,13.7711069418386]
[{"$f":"VLOOKUP(C140,Sheet3!$A$1:$C$821,2,FALSE)","v":"Elementary Schools"},"Electric","BLACKES","Cypress, TX",101992,44409,352896,460800,30.576713819368901,30451.93,38382.39,26.042552967907099,2283,2383,4.3802014892685097]
[{"$f":"VLOOKUP(C141,Sheet3!$A$1:$C$821,2,FALSE)","v":"Middle Schools"},"Electric","BLEYLMS","Houston, TX",234294,44409,831568,846329,1.77508033017144,61410.25,65160.21,6.1064073179965899,3544,3018,-14.8419864559819]
[{"$f":"VLOOKUP(C142,Sheet3!$A$1:$C$821,2,FALSE)","v":"Administration"},"Electric","BRADLEYPOLICESTATION","Cypress, TX",19680,43952,264192,284544,7.7034883720930196,15412.63,17424.939999999999,13.0562402393362,691,681,-1.4471780028943599]
["Special Schools","Electric","BRAUTIGAMCENTER","Houston, TX",79751,44409,370450,415012,12.0291537319476,32697.5,36080.51,10.346387338481501,2441,2207,-9.5862351495288802]
[{"$f":"VLOOKUP(C144,Sheet3!$A$1:$C$821,2,FALSE)","v":"High Schools"},"Electric","BRIDGELANDHS","Cypress, TX",579612,44409,2099955,2428646,15.652287787119199,158457.76999999999,189914.99,19.852115803472401,11327,11910,5.1469939083605496]
[{"$f":"VLOOKUP(C145,Sheet3!$A$1:$C$821,2,FALSE)","v":"Middle Schools"},"Electric","CAMPBELLMS","Houston, TX",232217,44409,1132438,943954,-16.644090007576601,76839.11,75389.600000000006,-1.8864221618392001,5316,3944,-25.808878856282899]
[{"$f":"VLOOKUP(C146,Sheet3!$A$1:$C$821,2,FALSE)","v":"Administration"},"Electric","CFISDNATATORIUM","Houston, TX",49471,367,1903765,1167906,-38.6528274235528,113850.91,84687.24,-25.615667015748901,4434,4058,-8.47992783040144]
[{"$f":"VLOOKUP(C147,Sheet3!$A$1:$C$821,2,FALSE)","v":"Middle Schools"},"Electric","COOKMS","Houston, TX",205797,43952,638267,830457,30.111223046154699,49977.01,62429.9,24.9172369455476,3683,3727,1.1946782514254699]
[{"$f":"VLOOKUP(C148,Sheet3!$A$1:$C$821,2,FALSE)","v":"Elementary Schools"},"Electric","COPELANDES","Houston, TX",91324,44409,389088,372096,-4.3671354552183601,32772.75,29487.54,-10.024212188479799,2544,1762,-30.738993710691801]
[{"$f":"VLOOKUP(C149,Sheet3!$A$1:$C$821,2,FALSE)","v":"High Schools"},"Electric","CY-CREEKHS","Houston, TX",528099,44409,2066960,2561196,23.911251306266202,157934.54999999999,191883.44,21.495543565356702,9119,9942,9.0251124026757292]
[{"$f":"VLOOKUP(C150,Sheet3!$A$1:$C$821,2,FALSE)","v":"Administration"},"Electric","CY-FAIRCOMPLEXRETENTIONPOND","Cypress, TX",0,367,707,1279,80.905233380480894,647.13,572.86,-11.476828457960501,77,59,-23.3766233766234]
[{"$f":"VLOOKUP(C151,Sheet3!$A$1:$C$821,2,FALSE)","v":"High Schools"},"Electric","CY-FAIRHS","Cypress, TX",507380,44409,2665766,2964097,11.191192325207799,178840.82,208523.38,16.597195204092699,8764,11276,28.6627110908261]
[{"$f":"VLOOKUP(C152,Sheet3!$A$1:$C$821,2,FALSE)","v":"Administration"},"Electric","CY-FAIRHS-BALLFIELD","Cypress, TX",0,367,17376,34365,97.772790055248606,6014.24,11873.1,97.416464923248796,681,1339,96.622613803230493]
[{"$f":"VLOOKUP(C153,Sheet3!$A$1:$C$821,2,FALSE)","v":"High Schools"},"Electric","CY-FALLSHS","Houston, TX",565245,44409,1929977,2150995,11.4518463173395,136580.89000000001,148399.12,8.6529162315460102,7146,6994,-2.12706409179961]
[{"$f":"VLOOKUP(C154,Sheet3!$A$1:$C$821,2,FALSE)","v":"High Schools"},"Electric","CY-LAKESHS","Katy, TX",514068,43952,2703196,2566491,-5.0571619667978203,171388.58,185252.92,8.0894187932474804,9969,8717,-12.5589326913432]
[{"$f":"VLOOKUP(C155,Sheet3!$A$1:$C$821,2,FALSE)","v":"High Schools"},"Electric","CY-PARKHS","Cypress, TX",764731,367,2848241,3439827,20.7702227444939,219136.23,264470.03000000003,20.6874965403941,13593,15944,17.295666887368501]
[{"$f":"VLOOKUP(C156,Sheet3!$A$1:$C$821,2,FALSE)","v":"High Schools"},"Electric","CY-RANCHHS","Cypress, TX",527481,44409,2480139,3121686,25.867380820187901,212318.86,236863.02,11.560046997238,17800,13477,-24.2865168539326]
[{"$f":"VLOOKUP(C157,Sheet3!$A$1:$C$821,2,FALSE)","v":"High Schools"},"Electric","CY-RIDGEHS","Houston, TX",502564,44044,2104756,2524740,19.954046929905399,142655.67000000001,178405.06,25.059915249074901,8765,9507,8.4654877353108908]
[{"$f":"VLOOKUP(C158,Sheet3!$A$1:$C$821,2,FALSE)","v":"High Schools"},"Electric","CY-SPRINGSHS","Cypress, TX",478615,44044,2169325,2283888,5.2810436426077203,138243.82,150069.57999999999,8.5542775076672495,8453,7782,-7.93801017390276]
[{"$f":"VLOOKUP(C159,Sheet3!$A$1:$C$821,2,FALSE)","v":"High Schools"},"Electric","CY-WOODSHS","Cypress, TX",501359,44409,1387201,1717099,23.781557250895901,93186.84,116732.84,25.267516314535399,5721,5820,1.7304667016255899]
[{"$f":"VLOOKUP(C160,Sheet3!$A$1:$C$821,2,FALSE)","v":"Elementary Schools"},"Electric","DANISHES","Houston, TX",98052,43952,446976,571680,27.8994845360825,37811.440000000002,43722.48,15.632940718470399,2320,2295,-1.07758620689655]
[{"$f":"VLOOKUP(C161,Sheet3!$A$1:$C$821,2,FALSE)","v":"Middle Schools"},"Electric","DEANMS","Houston, TX",222788,44044,852890,1120772,31.4087396967956,69973.429999999993,86639.59,23.817840571771299,4704,4556,-3.1462585034013602]
[{"$f":"VLOOKUP(C162,Sheet3!$A$1:$C$821,2,FALSE)","v":"Elementary Schools"},"Electric","DURYEAES","Katy, TX",96423,43952,317568,434304,36.759371221281697,28213.78,37346.160000000003,32.368509288723502,2180,2324,6.6055045871559601]
[{"$f":"VLOOKUP(C163,Sheet3!$A$1:$C$821,2,FALSE)","v":"Administration"},"Electric","ELC1","Houston, TX",6832,367,18800,25000,32.978723404255298,2180.58,2642.74,21.194361133276502,184,196,6.5217391304347796]
[{"$f":"VLOOKUP(C164,Sheet3!$A$1:$C$821,2,FALSE)","v":"Administration"},"Electric","ELC2","Houston, TX",4573,367,17459,22863,30.952517326307301,1923.63,2525.92,31.310075222365999,165,193,16.969696969697001]
[{"$f":"VLOOKUP(C165,Sheet3!$A$1:$C$821,2,FALSE)","v":"Administration"},"Electric","ELDRIDGETRANS","Houston, TX",26451,44409,305664,321792,5.27638190954774,19462,21412.85,10.0238927140068,1064,1012,-4.88721804511278]
[{"$f":"VLOOKUP(C166,Sheet3!$A$1:$C$821,2,FALSE)","v":"Elementary Schools"},"Electric","EMERYES","Katy, TX",98438,44044,314820,492480,56.432246998284697,27258.799999999999,39365.120000000003,44.412519993543398,2116,2360,11.531190926276]
[{"$f":"VLOOKUP(C167,Sheet3!$A$1:$C$821,2,FALSE)","v":"Elementary Schools"},"Electric","EMMOTTES","Houston, TX",77394,43952,244608,309312,26.452119309262201,22615.13,29049.48,28.4515278046158,1777,2006,12.886888013505899]
[{"$f":"VLOOKUP(C168,Sheet3!$A$1:$C$821,2,FALSE)","v":"Administration"},"Electric","EXHIBITCENTERSCIENCERESOURCEC","Cypress, TX",72198,367,385760,390240,1.1613438407299901,25023.87,28210.9,12.735959705673,1437,1499,4.3145441892832297]
[{"$f":"VLOOKUP(C169,Sheet3!$A$1:$C$821,2,FALSE)","v":"Administration"},"Electric","EXHIBITCENTERTELGEAG","Cypress, TX",33198,367,142447,108849,-23.5863163141379,8147.2,6852.02,-15.897240769834999,357,293,-17.9271708683473]
[{"$f":"VLOOKUP(C170,Sheet3!$A$1:$C$821,2,FALSE)","v":"Administration"},"Electric","FALCONCOMPLEX","Houston, TX",0,367,380064,386400,1.6670876483960599,23121.71,24888.82,7.6426440777952802,1162,1097,-5.5938037865748704]
[{"$f":"VLOOKUP(C171,Sheet3!$A$1:$C$821,2,FALSE)","v":"Elementary Schools"},"Electric","FARNEYES","Cypress, TX",95036,367,439680,586560,33.406113537117903,36926.46,46668.14,26.381299480101799,2957,2793,-5.5461616503212703]
[{"$f":"VLOOKUP(C172,Sheet3!$A$1:$C$821,2,FALSE)","v":"Elementary Schools"},"Electric","FIESTES","Houston, TX",96117,44409,303840,399168,31.374407582938399,23854.38,30084.799999999999,26.118557682069302,1612,1673,3.7841191066997499]
[{"$f":"VLOOKUP(C173,Sheet3!$A$1:$C$821,2,FALSE)","v":"Administration"},"Electric","FOODPRODUCTIONCENTER","Houston, TX",57684,367,1713011,1863063,8.7595467863311995,100883.45,114243.09,13.2426478277656,3610,3624,0.38781163434902999]
[{"$f":"VLOOKUP(C174,Sheet3!$A$1:$C$821,2,FALSE)","v":"Administration"},"Electric","FOODSERVICEWAREHOUSE","Houston, TX",48487,43952,343200,303936,-11.440559440559401,21483.93,21810.17,1.5185303619961501,1096,1095,-9.12408759124088E-2]
[{"$f":"VLOOKUP(C175,Sheet3!$A$1:$C$821,2,FALSE)","v":"Elementary Schools"},"Electric","FRANCONEES","Houston, TX",88982,44409,371904,502848,35.209086215797598,31753.06,37854.519999999997,19.215344914789299,2397,2110,-11.973299958281199]
[{"$f":"VLOOKUP(C176,Sheet3!$A$1:$C$821,2,FALSE)","v":"Elementary Schools"},"Electric","FRAZIERES","Houston, TX",88177,44409,401369,603964,50.475995904018497,34639.480000000003,48272.23,39.356104652841204,2362,2577,9.1024555461473309]
[{"$f":"VLOOKUP(C177,Sheet3!$A$1:$C$821,2,FALSE)","v":"Elementary Schools"},"Electric","GLEASONES","Houston, TX",91424,367,463680,598464,29.068322981366499,34663.660000000003,48029.27,38.557988394762702,2396,2900,21.0350584307179]
[{"$f":"VLOOKUP(C178,Sheet3!$A$1:$C$821,2,FALSE)","v":"Middle Schools"},"Electric","GOODSONMS","Cypress, TX",218801,367,740996,1019110,37.532456315553702,57021.21,74033.39,29.834828127989599,4147,4240,2.2425850012056898]
[{"$f":"VLOOKUP(C179,Sheet3!$A$1:$C$821,2,FALSE)","v":"Elementary Schools"},"Electric","HAIRGROVEES","Houston, TX",90830,44409,405504,465408,14.7727272727273,31770.799999999999,35838.300000000003,12.802636383093899,2289,2046,-10.6159895150721]
[{"$f":"VLOOKUP(C180,Sheet3!$A$1:$C$821,2,FALSE)","v":"Elementary Schools"},"Electric","HAMILTONES","Cypress, TX",89692,44044,278208,354240,27.329192546583901,23800.09,28939.29,21.5931956559828,1745,1759,0.80229226361031503]
[{"$f":"VLOOKUP(C181,Sheet3!$A$1:$C$821,2,FALSE)","v":"Middle Schools"},"Electric","HAMILTONMS","Cypress, TX",194726,44044,843921,875195,3.7057971066012101,59386.2,65664.429999999993,10.571866864692501,2807,3644,29.818311364446]
[{"$f":"VLOOKUP(C182,Sheet3!$A$1:$C$821,2,FALSE)","v":"Elementary Schools"},"Electric","HANCOCKES","Houston, TX",87259,44409,360080,466848,29.651188624750102,32319.919999999998,38447.58,18.959390988591601,2405,2389,-0.66528066528066498]
[{"$f":"VLOOKUP(C183,Sheet3!$A$1:$C$821,2,FALSE)","v":"Elementary Schools"},"Electric","HEMMENWAYES","Katy, TX",101091,44044,333696,509568,52.704257767548903,31742.68,43879.79,38.235933449853597,2617,2783,6.3431410011463498]
[{"$f":"VLOOKUP(C184,Sheet3!$A$1:$C$821,2,FALSE)","v":"Elementary Schools"},"Electric","HOLBROOKES","Houston, TX",99937,367,403200,556224,37.952380952380999,33913.24,44675.360000000001,31.7342725142157,2468,2604,5.5105348460291701]
[{"$f":"VLOOKUP(C185,Sheet3!$A$1:$C$821,2,FALSE)","v":"Elementary Schools"},"Electric","HOLMSLEYES","Houston, TX",81704,44044,259584,327936,26.331360946745601,22064.37,25873.15,17.262128943631701,1564,1520,-2.8132992327365698]
[{"$f":"VLOOKUP(C186,Sheet3!$A$1:$C$821,2,FALSE)","v":"Elementary Schools"},"Electric","HOOVERES","Katy, TX",112519,367,348480,450000,29.132231404958699,28686.400000000001,34354.17,19.7576900552178,1958,1938,-1.0214504596527101]
[{"$f":"VLOOKUP(C187,Sheet3!$A$1:$C$821,2,FALSE)","v":"Middle Schools"},"Electric","HOPPERMS","Cypress, TX",226178,367,875010,1038949,18.735671592324699,67275.05,84024.56,24.8970606487844,4687,4129,-11.905269895455501]
[{"$f":"VLOOKUP(C188,Sheet3!$A$1:$C$821,2,FALSE)","v":"Elementary Schools"},"Electric","HORNEES","Houston, TX",95855,44409,396096,506880,27.968977217644198,31011.66,39897,28.651610394283999,2181,2333,6.9692801467216903]
[{"$f":"VLOOKUP(C189,Sheet3!$A$1:$C$821,2,FALSE)","v":"Administration"},"Electric","ISCA","Houston, TX",132467,367,266960,284460,6.5552891818999104,19778.169999999998,22114.69,11.813630886983001,1297,1272,-1.9275250578257499]
[{"$f":"VLOOKUP(C190,Sheet3!$A$1:$C$821,2,FALSE)","v":"Administration"},"Electric","ISCB","Houston, TX",0,367,257440,268020,4.1096954630205103,17756.759999999998,19143.830000000002,7.8115039004863496,1057,995,-5.8656575212866597]
[{"$f":"VLOOKUP(C191,Sheet3!$A$1:$C$821,2,FALSE)","v":"Administration"},"Electric","ISCC","Houston, TX",0,367,457120,493040,7.8578928946447304,28749.34,33358.17,16.031081061339101,1513,1592,5.22141440846001]
[{"$f":"VLOOKUP(C192,Sheet3!$A$1:$C$821,2,FALSE)","v":"Administration"},"Electric","ISCC-EXLIGHT","Houston, TX",0,367,3660,3660,0,509.56,462.89,-9.1588821728550105,0,0,0]
[{"$f":"VLOOKUP(C193,Sheet3!$A$1:$C$821,2,FALSE)","v":"Administration"},"Electric","ISCD","Houston, TX",0,367,9680,10680,10.3305785123967,1175.24,1324.05,12.6620945509002,95,103,8.4210526315789505]
[{"$f":"VLOOKUP(C194,Sheet3!$A$1:$C$821,2,FALSE)","v":"Administration"},"Electric","ISCDATACENTER","Houston, TX",0,367,113320,146018,28.8545711260148,6042.27,8018.12,32.700458602478903,191,237,24.083769633507899]
[{"$f":"VLOOKUP(C195,Sheet3!$A$1:$C$821,2,FALSE)","v":"Administration"},"Electric","ISCSW","Houston, TX",0,367,33148,32292,-2.58235790997949,2356.46,2525.6,7.1777157261315701,141,140,-0.70921985815602795]
[{"$f":"VLOOKUP(C196,Sheet3!$A$1:$C$821,2,FALSE)","v":"Administration"},"Electric","ISCW","Houston, TX",35364,367,255552,337536,32.081141998497401,19316,25162.9,30.269724580658501,1322,1384,4.6898638426626302]
[{"$f":"VLOOKUP(C197,Sheet3!$A$1:$C$821,2,FALSE)","v":"Administration"},"Electric","JARVISCENTRALPLANT","Cypress, TX",12152,367,933668,1480862,58.606913806620803,103924.8,134377.59,29.302716964574401,10639,9140,-14.089670081774599]
[{"$f":"VLOOKUP(C198,Sheet3!$A$1:$C$821,2,FALSE)","v":"High Schools"},"Electric","JERSEYVILLAGEHS","Houston, TX",513823,44409,1953736,2462530,26.042105995897099,147069.85999999999,182975.05,24.413697000867501,9855,9487,-3.7341451040081202]
[{"$f":"VLOOKUP(C199,Sheet3!$A$1:$C$821,2,FALSE)","v":"Administration"},"Electric","JERSEYVILLAGESTADIUM","Houston, TX",2385,367,43296,19200,-55.654101995565398,6759.38,6946.31,2.7654903260358199,750,780,4]
[{"$f":"VLOOKUP(C200,Sheet3!$A$1:$C$821,2,FALSE)","v":"Elementary Schools"},"Electric","JOWELLES","Katy, TX",73726,367,227520,304512,33.839662447257403,21136.43,24456.58,15.70818723881,1511,1471,-2.6472534745201899]
[{"$f":"VLOOKUP(C201,Sheet3!$A$1:$C$821,2,FALSE)","v":"Middle Schools"},"Electric","KAHLAMS","Houston, TX",221601,367,854008,1114574,30.5109554008862,76153.55,89789.41,17.9057443809251,5237,4731,-9.6620202405957603]
[{"$f":"VLOOKUP(C202,Sheet3!$A$1:$C$821,2,FALSE)","v":"Elementary Schools"},"Electric","KEITHES","Cypress, TX",95518,367,340416,456384,34.066553863508197,27995.58,37967.760000000002,35.6205515299201,1990,2350,18.090452261306499]
[{"$f":"VLOOKUP(C203,Sheet3!$A$1:$C$821,2,FALSE)","v":"Elementary Schools"},"Electric","KIRKES","Houston, TX",93897,367,434880,592704,36.291390728476799,34657.06,45926.59,32.5172706513478,2555,2621,2.5831702544031301]
[{"$f":"VLOOKUP(C204,Sheet3!$A$1:$C$821,2,FALSE)","v":"Middle Schools"},"Electric","LABAYMS","Houston, TX",190510,43952,685795,697986,1.77764492304552,53473.96,56597.84,5.84187144546617,3692,3281,-11.1321776814735]
[{"$f":"VLOOKUP(C205,Sheet3!$A$1:$C$821,2,FALSE)","v":"Elementary Schools"},"Electric","LAMKINES","Cypress, TX",113622,43956,339120,457920,35.031847133757999,27560.67,38613.86,40.104939393708499,1930,2441,26.4766839378238]
[{"$f":"VLOOKUP(C206,Sheet3!$A$1:$C$821,2,FALSE)","v":"High Schools"},"Electric","LANGHAMCREEKHS","Houston, TX",536036,44409,1444014,1681874,16.472139466791901,104856.89,126480.75,20.622259538691299,6905,7284,5.4887762490948599]
[{"$f":"VLOOKUP(C207,Sheet3!$A$1:$C$821,2,FALSE)","v":"Administration"},"Electric","LANGHAMCREEKRETENTIONPOND","Houston, TX",0,367,1536,3360,118.75,2115.5300000000002,1673.55,-20.8921641385374,278,185,-33.4532374100719]
[{"$f":"VLOOKUP(C208,Sheet3!$A$1:$C$821,2,FALSE)","v":"Elementary Schools"},"Electric","LEEES","Houston, TX",95352,367,398976,555840,39.316650625601497,31802.01,47454.51,49.218587127040102,2343,3026,29.150661545027699]
[{"$f":"VLOOKUP(C209,Sheet3!$A$1:$C$821,2,FALSE)","v":"Elementary Schools"},"Electric","LIEDERES","Houston, TX",83798,44440,321120,388800,21.076233183856498,28994.19,30923.84,6.6552988719464103,2243,1849,-17.5657601426661]
[{"$f":"VLOOKUP(C210,Sheet3!$A$1:$C$821,2,FALSE)","v":"Elementary Schools"},"Electric","LOWERYES","Houston, TX",92034,44409,345408,561792,62.6459143968872,30808.46,44412.05,44.155371608967101,2338,2654,13.5158254918734]
[{"$f":"VLOOKUP(C211,Sheet3!$A$1:$C$821,2,FALSE)","v":"Administration"},"Electric","MAINTENANCEOPER","Houston, TX",36679,43952,370944,391488,5.5383022774327104,25776.43,28628.7,11.065419066953799,1634,1544,-5.5079559363525101]
[{"$f":"VLOOKUP(C212,Sheet3!$A$1:$C$821,2,FALSE)","v":"Elementary Schools"},"Electric","MATZKEMILLSES","Houston, TX",127754,44440,406848,490752,20.622935346861698,32256.639999999999,37613.949999999997,16.608394426697899,2175,2161,-0.64367816091954]
[{"$f":"VLOOKUP(C213,Sheet3!$A$1:$C$821,2,FALSE)","v":"Elementary Schools"},"Electric","MCFEEES","Katy, TX",105539,367,401184,542851,35.312225811597699,32930.85,42067.55,27.745108310292601,2023,2066,2.1255561047948599]
[{"$f":"VLOOKUP(C214,Sheet3!$A$1:$C$821,2,FALSE)","v":"Elementary Schools"},"Electric","METCALFES","Houston, TX",85120,43956,292896,327456,11.7994100294985,27146.41,27411.59,0.97685108270301702,2182,1725,-20.944087992667299]
[{"$f":"VLOOKUP(C215,Sheet3!$A$1:$C$821,2,FALSE)","v":"Elementary Schools"},"Electric","MILLSAPES","Cypress, TX",94477,44409,294144,481536,63.707571801566601,25695.75,33509.61,30.4091532646449,1928,1675,-13.1224066390042]
[{"$f":"VLOOKUP(C216,Sheet3!$A$1:$C$821,2,FALSE)","v":"Administration"},"Electric","MILLSAPNATURETRAIL","Cypress, TX",1121,367,1619,1612,-0.43236565781346498,136.22999999999999,137.32,0.80011744843279697,13,7,-46.153846153846203]
[{"$f":"VLOOKUP(C217,Sheet3!$A$1:$C$821,2,FALSE)","v":"Administration"},"Electric","MILLSAPROPES","Cypress, TX",924,367,2301,2551,10.864841373315899,181.31,202.45,11.659588549997199,10,6,-40]
[{"$f":"VLOOKUP(C218,Sheet3!$A$1:$C$821,2,FALSE)","v":"Elementary Schools"},"Electric","MOOREES","Houston, TX",83063,43952,252480,326016,29.125475285171099,22248.51,25767.040000000001,15.814677027809999,1645,1515,-7.9027355623100304]
[{"$f":"VLOOKUP(C219,Sheet3!$A$1:$C$821,2,FALSE)","v":"Elementary Schools"},"Electric","OWENSES","Houston, TX",87177,44409,364416,519360,42.518440463645902,32761.15,43389.81,32.442878226191702,2664,2689,0.93843843843843799]
[{"$f":"VLOOKUP(C220,Sheet3!$A$1:$C$821,2,FALSE)","v":"Elementary Schools"},"Electric","POPEES","Cypress, TX",112970,367,338304,381078,12.6436577752554,26131.91,35454.19,35.673932751184303,1881,2117,12.5465178096757]
[{"$f":"VLOOKUP(C221,Sheet3!$A$1:$C$821,2,FALSE)","v":"Elementary Schools"},"Electric","POSTES","Houston, TX",104852,367,427776,529344,23.743267504488301,36229.550000000003,43664.83,20.522694872003701,2672,2640,-1.19760479041916]
[{"$f":"VLOOKUP(C222,Sheet3!$A$1:$C$821,2,FALSE)","v":"Elementary Schools"},"Electric","POSTMAES","Cypress, TX",98920,367,360960,460032,27.446808510638299,29504.59,34971.25,18.528167990133099,2142,1973,-7.8898225957049499]
[{"$f":"VLOOKUP(C223,Sheet3!$A$1:$C$821,2,FALSE)","v":"Administration"},"Electric","PRIDGEONSTADIUM","Houston, TX",86181,367,280224,302400,7.9136690647482002,19766.11,24916.68,26.05758037368,1134,1582,39.506172839506199]
[{"$f":"VLOOKUP(C224,Sheet3!$A$1:$C$821,2,FALSE)","v":"Administration"},"Electric","RECYCLECENTER","Houston, TX",0,367,5760,6528,13.3333333333333,801.71,1052.73,31.310573648825599,72,92,27.7777777777778]
[{"$f":"VLOOKUP(C225,Sheet3!$A$1:$C$821,2,FALSE)","v":"Elementary Schools"},"Electric","REEDES","Houston, TX",90012,367,385920,410880,6.4676616915422898,30770.13,35211.300000000003,14.433380684449499,2151,2252,4.6954904695490498]
[{"$f":"VLOOKUP(C226,Sheet3!$A$1:$C$821,2,FALSE)","v":"Elementary Schools"},"Electric","RENNELLES","Cypress, TX",118229,44409,249727,337034,34.960977387306897,16818.77,23447.82,39.414594527423802,926,1158,25.053995680345601]
[{"$f":"VLOOKUP(C227,Sheet3!$A$1:$C$821,2,FALSE)","v":"Elementary Schools"},"Electric","ROBINSONES","Katy, TX",101604,44409,333120,486144,45.936599423631101,29049.25,40419.42,39.141010525228701,2177,2503,14.9747358750574]
[{"$f":"VLOOKUP(C228,Sheet3!$A$1:$C$821,2,FALSE)","v":"Elementary Schools"},"Electric","ROBISONES","Cypress, TX",93882,43952,287040,383520,33.612040133779303,19387.36,26813.52,38.304132176841001,1193,1362,14.165968147527201]
[{"$f":"VLOOKUP(C229,Sheet3!$A$1:$C$821,2,FALSE)","v":"Middle Schools"},"Electric","SALYARDSMS","Cypress, TX",247012,44409,778847,930775,19.506783745716401,60233.53,67362.09,11.834870046633499,4008,3475,-13.298403193612801]
[{"$f":"VLOOKUP(C230,Sheet3!$A$1:$C$821,2,FALSE)","v":"Elementary Schools"},"Electric","SAMPSONES","Cypress, TX",96096,367,358272,520128,45.1768488745981,30847.75,41941.03,35.961391025277401,2258,2543,12.621789193976999]
[{"$f":"VLOOKUP(C231,Sheet3!$A$1:$C$821,2,FALSE)","v":"Administration"},"Electric","SATELLITECOLDFOODWAREHOUSE","Cypress, TX",22020,367,776448,807360,3.9812067260138502,42906.67,47608.51,10.9582962276028,1827,1798,-1.5873015873015901]
[{"$f":"VLOOKUP(C232,Sheet3!$A$1:$C$821,2,FALSE)","v":"Elementary Schools"},"Electric","SHERIDANES","Katy, TX",100760,44409,417792,450816,7.9044117647058796,35486.959999999999,34024.46,-4.1212321371004998,2748,1918,-30.203784570596799]
[{"$f":"VLOOKUP(C233,Sheet3!$A$1:$C$821,2,FALSE)","v":"Middle Schools"},"Electric","SMITHMS","Cypress, TX",234695,44409,519360,671040,29.205175600739398,34796.44,48059.53,38.116226832400102,1940,2506,29.175257731958801]
[{"$f":"VLOOKUP(C234,Sheet3!$A$1:$C$821,2,FALSE)","v":"Middle Schools"},"Electric","SPILLANEMS","Cypress, TX",235889,367,799186,929262,16.276060891957599,50895.29,63081.84,23.944357130099899,2556,2864,12.0500782472613]
[{"$f":"VLOOKUP(C235,Sheet3!$A$1:$C$821,2,FALSE)","v":"Elementary Schools"},"Electric","SWENKEES","Cypress, TX",107914,367,355680,524880,47.570850202429099,31685.34,43068.62,35.926014996209602,2520,2628,4.28571428571429]
[{"$f":"VLOOKUP(C236,Sheet3!$A$1:$C$821,2,FALSE)","v":"Administration"},"Electric","TELGETRANS","Cypress, TX",19649,367,153680,181760,18.271733472149901,10015.120000000001,12643.41,26.243220250980499,569,634,11.423550087873499]
[{"$f":"VLOOKUP(C237,Sheet3!$A$1:$C$821,2,FALSE)","v":"Middle Schools"},"Electric","THORNTONMS","Katy, TX",202739,44044,756085,800133,5.8258000092582201,56505.82,60671.76,7.3725856911730503,4047,3532,-12.725475660983401]
[{"$f":"VLOOKUP(C238,Sheet3!$A$1:$C$821,2,FALSE)","v":"Elementary Schools"},"Electric","TIPPSES","Houston, TX",101727,367,457061,568661,24.4168721461687,34380.26,45101.79,31.185133562108,2026,2337,15.350444225074]
[{"$f":"VLOOKUP(C239,Sheet3!$A$1:$C$821,2,FALSE)","v":"Middle Schools"},"Electric","TRUITTMS","Houston, TX",209274,43952,545553,674583,23.651230952812998,42449.32,50324.18,18.551204118228501,3108,2915,-6.2097812097812097]
[{"$f":"VLOOKUP(C240,Sheet3!$A$1:$C$821,2,FALSE)","v":"Elementary Schools"},"Electric","WALKERES","Katy, TX",98321,367,374489,505996,35.116385260982298,35063.79,42045.61,19.911766526094301,2005,2362,17.805486284289302]
[{"$f":"VLOOKUP(C241,Sheet3!$A$1:$C$821,2,FALSE)","v":"Elementary Schools"},"Electric","WARNERES","Cypress, TX",98451,44044,348068,354694,1.9036510107220399,22000.52,25496.74,15.8915334728452,1284,1292,0.62305295950155803]
[{"$f":"VLOOKUP(C242,Sheet3!$A$1:$C$821,2,FALSE)","v":"Middle Schools"},"Electric","WATKINSMS","Houston, TX",221773,44409,815114,935493,14.768363689005501,59216.75,68375.81,15.4670089121743,3623,3360,-7.2591774772288202]
[{"$f":"VLOOKUP(C243,Sheet3!$A$1:$C$821,2,FALSE)","v":"Elementary Schools"},"Electric","WELLSES","Cypress, TX",136702,44409,421440,499200,18.4510250569476,35132.94,39150.43,11.4351090458128,2495,2283,-8.4969939879759497]
[{"$f":"VLOOKUP(C244,Sheet3!$A$1:$C$821,2,FALSE)","v":"Administration"},"Electric","WESTGREENAGSCIENCECENTER","Cypress, TX",32574,44409,53376,58752,10.071942446043201,3116.83,4013.69,28.774748703009099,133,198,48.872180451127797]
[{"$f":"VLOOKUP(C245,Sheet3!$A$1:$C$821,2,FALSE)","v":"Administration"},"Electric","WESTGREENTRANS","Cypress, TX",45340,367,239040,246912,3.2931726907630501,14946.66,16194.51,8.3486879342943503,747,740,-0.93708165997322601]
[{"$f":"VLOOKUP(C246,Sheet3!$A$1:$C$821,2,FALSE)","v":"Elementary Schools"},"Electric","WILLBERNES","Houston, TX",89993,367,317664,398304,25.385312783318199,26338.76,30225.86,14.758097951460099,1847,1707,-7.5798592311857096]
[{"$f":"VLOOKUP(C247,Sheet3!$A$1:$C$821,2,FALSE)","v":"Elementary Schools"},"Electric","WILSONES","Houston, TX",86854,44409,339072,443520,30.804077010192501,29136.69,35612.5,22.225620000075502,2296,2120,-7.6655052264808399]
[{"$f":"VLOOKUP(C248,Sheet3!$A$1:$C$821,2,FALSE)","v":"Special Schools"},"Electric","WINDFERNANNEX","Houston, TX",59400,43952,306432,314112,2.5062656641604,22518.240000000002,23990.39,6.5375890833386601,1516,1358,-10.4221635883905]
[{"$f":"VLOOKUP(C249,Sheet3!$A$1:$C$821,2,FALSE)","v":"Special Schools"},"Electric","WINDFERNHS","Houston, TX",50022,367,307200,286848,-6.625,23670.62,23416.51,-1.0735249013333801,1607,1438,-10.516490354698201]
[{"$f":"VLOOKUP(C250,Sheet3!$A$1:$C$821,2,FALSE)","v":"Elementary Schools"},"Electric","WOODARDES","Cypress, TX",116974,44044,401040,474480,18.3123877917415,34982.730000000003,38293.17,9.4630693487900999,2592,2297,-11.381172839506201]
[{"$f":"VLOOKUP(C251,Sheet3!$A$1:$C$821,2,FALSE)","v":"Elementary Schools"},"Electric","YEAGERES","Houston, TX",99033,44409,324576,432864,33.362910381543898,28133.69,33848,20.311270935309199,2169,1971,-9.1286307053941904]
[{"$f":"VLOOKUP(C252,Sheet3!$A$1:$C$821,2,FALSE)","v":"Elementary Schools"},"Water","ADAM-ES","Houston, TX",103177,367,664,761,14.608433734939799,6696.38,7982.51,19.206347310039199,0,0,0]
[{"$f":"VLOOKUP(C253,Sheet3!$A$1:$C$821,2,FALSE)","v":"Special Schools"},"Water","ALCWEST","Katy, TX",50839,367,204,94,-53.921568627451002,2401.65,1700.9,-29.177856890054802,0,0,0]
[{"$f":"VLOOKUP(C254,Sheet3!$A$1:$C$821,2,FALSE)","v":"Elementary Schools"},"Water","ANDREES","Cypress, TX",100156,43952,1553,1307,-15.8403090792015,18140.95,17202.34,-5.1739848243890201,0,0,0]
[{"$f":"VLOOKUP(C255,Sheet3!$A$1:$C$821,2,FALSE)","v":"Middle Schools"},"Water","ANTHONYMS","Cypress, TX",244123,367,2596,1707,-34.244992295839801,28629.119999999999,20687.96,-27.738051326760999,0,0,0]
[{"$f":"VLOOKUP(C256,Sheet3!$A$1:$C$821,2,FALSE)","v":"Middle Schools"},"Water","ARAGONMS","Houston, TX",219821,367,2112,1817,-13.967803030302999,16818.62,14976.72,-10.951552505496901,0,0,0]
[{"$f":"VLOOKUP(C257,Sheet3!$A$1:$C$821,2,FALSE)","v":"Elementary Schools"},"Water","AULTES","Cypress, TX",91912,43952,891,1376,54.433221099887803,6968.85,11084,59.050632457292103,0,0,0]
[{"$f":"VLOOKUP(C258,Sheet3!$A$1:$C$821,2,FALSE)","v":"Elementary Schools"},"Water","BANEES","Houston, TX",106804,367,741,492,-33.603238866396801,8787.08,6881.11,-21.690595738288501,0,0,0]
[{"$f":"VLOOKUP(C259,Sheet3!$A$1:$C$821,2,FALSE)","v":"Elementary Schools"},"Water","BANGES","Houston, TX",89313,44044,968,814,-15.909090909090899,9329.86,8111.05,-13.0635400745563,0,0,0]
[{"$f":"VLOOKUP(C260,Sheet3!$A$1:$C$821,2,FALSE)","v":"Administration"},"Water","BARKERTRANS","Houston, TX",22677,367,590,480,-18.644067796610202,2420.69,2267.19,-6.3411671878679199,0,0,0]
[{"$f":"VLOOKUP(C261,Sheet3!$A$1:$C$821,2,FALSE)","v":"Administration"},"Water","BERRYCENTER","Cypress, TX",491434,367,4082,3115,-23.689367956883899,34088.639999999999,27031.56,-20.7021459348334,0,0,0]
[{"$f":"VLOOKUP(C262,Sheet3!$A$1:$C$821,2,FALSE)","v":"Elementary Schools"},"Water","BIRKESES","Houston, TX",104952,44044,1297,1207,-6.9390902081727104,10399.17,9964.1200000000008,-4.1835069529587496,0,0,0]
[{"$f":"VLOOKUP(C263,Sheet3!$A$1:$C$821,2,FALSE)","v":"Elementary Schools"},"Water","BLACKES","Cypress, TX",101992,44409,1319,1539,16.6793025018954,16826.330000000002,20176.53,19.910461758446399,0,0,0]
[{"$f":"VLOOKUP(C264,Sheet3!$A$1:$C$821,2,FALSE)","v":"Middle Schools"},"Water","BLEYLMS","Houston, TX",234294,44409,2157.5,2910,34.878331402085699,10851.08,11411.87,5.1680570044640701,0,0,0]
[{"$f":"VLOOKUP(C265,Sheet3!$A$1:$C$821,2,FALSE)","v":"Administration"},"Water","BRADLEYPOLICESTATION","Cypress, TX",19680,43952,145,67,-53.7931034482759,949.5,435.95,-54.086361242759402,0,0,0]
["Special Schools","Water","BRAUTIGAMCENTER","Houston, TX",79751,44409,312.94499999999999,1280.6300000000001,309.21887232580798,12919.25,15972.3,23.631789771078001,0,0,0]
[{"$f":"VLOOKUP(C267,Sheet3!$A$1:$C$821,2,FALSE)","v":"High Schools"},"Water","BRIDGELANDHS","Cypress, TX",579612,44409,5445,5458,0.238751147842057,47519.25,49159.94,3.45268496451438,0,0,0]
[{"$f":"VLOOKUP(C268,Sheet3!$A$1:$C$821,2,FALSE)","v":"Middle Schools"},"Water","COOKMS","Houston, TX",205797,43952,3387,2059,-39.208739297313301,34197.61,21516.93,-37.080603001203897,0,0,0]
[{"$f":"VLOOKUP(C269,Sheet3!$A$1:$C$821,2,FALSE)","v":"Elementary Schools"},"Water","COPELANDES","Houston, TX",91324,44409,1758,975,-44.539249146757697,13835.85,9480.5499999999993,-31.478369597820201,0,0,0]
[{"$f":"VLOOKUP(C270,Sheet3!$A$1:$C$821,2,FALSE)","v":"High Schools"},"Water","CY-CREEKHS","Houston, TX",528099,44409,9578.58,7775.47,-18.824397770859601,68829.710000000006,69522.559999999998,1.0066147307608899,0,0,0]
[{"$f":"VLOOKUP(C271,Sheet3!$A$1:$C$821,2,FALSE)","v":"Administration"},"Water","CY-FAIRCOMPLEX","Cypress, TX",0,367,15717,10835,-31.061907488706499,112467.45,80235.95,-28.658514085631001,0,0,0]
[{"$f":"VLOOKUP(C272,Sheet3!$A$1:$C$821,2,FALSE)","v":"High Schools"},"Water","CY-FALLSHS","Houston, TX",565245,44409,4159,4420,6.2755470064919496,42239.7,45430.15,7.5532023191452602,0,0,0]
[{"$f":"VLOOKUP(C273,Sheet3!$A$1:$C$821,2,FALSE)","v":"High Schools"},"Water","CY-LAKESHS","Katy, TX",514068,43952,5898,5426,-8.0027127839945695,48703.8,46541.36,-4.4399820958528897,0,0,0]
[{"$f":"VLOOKUP(C274,Sheet3!$A$1:$C$821,2,FALSE)","v":"High Schools"},"Water","CY-PARKHS","Cypress, TX",590057,367,5494,4645,-15.453221696396101,42524.19,37312.199999999997,-12.2565297540059,0,0,0]
[{"$f":"VLOOKUP(C275,Sheet3!$A$1:$C$821,2,FALSE)","v":"High Schools"},"Water","CY-RANCHHS","Cypress, TX",527481,44409,6551,5174,-21.019691650129801,57735.7,49609.04,-14.0756239207284,0,0,0]
[{"$f":"VLOOKUP(C276,Sheet3!$A$1:$C$821,2,FALSE)","v":"High Schools"},"Water","CY-RIDGEHS","Houston, TX",502564,44044,5010,4094,-18.283433133732501,34968.769999999997,29779.67,-14.8392408426147,0,0,0]
[{"$f":"VLOOKUP(C277,Sheet3!$A$1:$C$821,2,FALSE)","v":"High Schools"},"Water","CY-SPRINGSHS","Cypress, TX",478615,44044,13073,12484,-4.5054692878451803,133372.54,130684.9,-2.0151374488331699,0,0,0]
[{"$f":"VLOOKUP(C278,Sheet3!$A$1:$C$821,2,FALSE)","v":"High Schools"},"Water","CY-WOODSHS","Cypress, TX",501359,44409,2786,1865,-33.0581478822685,26808.720000000001,19120.080000000002,-28.6796236448439,0,0,0]
[{"$f":"VLOOKUP(C279,Sheet3!$A$1:$C$821,2,FALSE)","v":"Elementary Schools"},"Water","DANISHES","Houston, TX",98052,43952,982,1120,14.052953156822801,9914.9,11759.64,18.605734803175,0,0,0]
[{"$f":"VLOOKUP(C280,Sheet3!$A$1:$C$821,2,FALSE)","v":"Middle Schools"},"Water","DEANMS","Houston, TX",222788,44044,3951,2939,-25.6137686661605,19782.84,34995.5,76.898261321428095,0,0,0]
[{"$f":"VLOOKUP(C281,Sheet3!$A$1:$C$821,2,FALSE)","v":"Elementary Schools"},"Water","DURYEAES","Katy, TX",96423,43952,1211,1054,-12.964492155243599,11603.98,11310.12,-2.5324069845001498,0,0,0]
[{"$f":"VLOOKUP(C282,Sheet3!$A$1:$C$821,2,FALSE)","v":"Administration"},"Water","ELC1","Houston, TX",6832,367,85.6,80.099999999999994,-6.4252336448598104,943.51,926.88,-1.76256743436742,0,0,0]
[{"$f":"VLOOKUP(C283,Sheet3!$A$1:$C$821,2,FALSE)","v":"Administration"},"Water","ELC2","Houston, TX",4573,367,197,107,-45.685279187817301,1559.43,705.97,-54.728971483170099,0,0,0]
[{"$f":"VLOOKUP(C284,Sheet3!$A$1:$C$821,2,FALSE)","v":"Administration"},"Water","ELDRIDGETRANS","Houston, TX",26451,44409,733,628,-14.324693042291999,5570.8,4929.8,-11.506426366051601,0,0,0]
[{"$f":"VLOOKUP(C285,Sheet3!$A$1:$C$821,2,FALSE)","v":"Elementary Schools"},"Water","EMERYES","Katy, TX",98438,44044,1210,940,-22.3140495867769,10581,8604.7999999999993,-18.676873641432799,0,0,0]
[{"$f":"VLOOKUP(C286,Sheet3!$A$1:$C$821,2,FALSE)","v":"Elementary Schools"},"Water","EMMOTTES","Houston, TX",77394,43952,1163,1079,-7.2226999140154797,7834.35,7724.15,-1.4066259485471,0,0,0]
[{"$f":"VLOOKUP(C287,Sheet3!$A$1:$C$821,2,FALSE)","v":"Administration"},"Water","FALCONCOMPLEX","Houston, TX",0,367,7957.4,2584.8000000000002,-67.517028175032095,97518.56,32906.660000000003,-66.256002959846796,0,0,0]
[{"$f":"VLOOKUP(C288,Sheet3!$A$1:$C$821,2,FALSE)","v":"Elementary Schools"},"Water","FARNEYES","Cypress, TX",95036,367,1341.4,953,-28.9548233189205,10983.48,9758.08,-11.1567554181371,0,0,0]
[{"$f":"VLOOKUP(C289,Sheet3!$A$1:$C$821,2,FALSE)","v":"Elementary Schools"},"Water","FIESTES","Houston, TX",96117,44409,998,841,-15.7314629258517,12131.93,11494.19,-5.2567068883516503,0,0,0]
[{"$f":"VLOOKUP(C290,Sheet3!$A$1:$C$821,2,FALSE)","v":"Elementary Schools"},"Water","FRANCONEES","Houston, TX",88982,44409,739,466,-36.941813261163702,4921.2299999999996,3345.98,-32.009274104238202,0,0,0]
[{"$f":"VLOOKUP(C291,Sheet3!$A$1:$C$821,2,FALSE)","v":"Elementary Schools"},"Water","FRAZIERES","Houston, TX",88177,44409,336,310,-7.7380952380952399,1759.5,1644.2,-6.55299801079852,0,0,0]
[{"$f":"VLOOKUP(C292,Sheet3!$A$1:$C$821,2,FALSE)","v":"Elementary Schools"},"Water","GLEASONES","Houston, TX",91424,367,926.20600000000002,1423,53.637527720615097,6890.7,11261.75,63.434048790398698,0,0,0]
[{"$f":"VLOOKUP(C293,Sheet3!$A$1:$C$821,2,FALSE)","v":"Middle Schools"},"Water","GOODSONMS","Cypress, TX",218801,367,2128,1826,-14.1917293233083,20195.759999999998,18305.52,-9.3595883492376597,0,0,0]
[{"$f":"VLOOKUP(C294,Sheet3!$A$1:$C$821,2,FALSE)","v":"Elementary Schools"},"Water","HAIRGROVEES","Houston, TX",90830,44409,1038,1009,-2.7938342967244698,10773.32,10691.43,-0.76011851499816196,0,0,0]
[{"$f":"VLOOKUP(C295,Sheet3!$A$1:$C$821,2,FALSE)","v":"Elementary Schools"},"Water","HAMILTONES","Cypress, TX",89692,44044,1875,858,-54.24,19175.25,10381.02,-45.862400750968,0,0,0]
[{"$f":"VLOOKUP(C296,Sheet3!$A$1:$C$821,2,FALSE)","v":"Middle Schools"},"Water","HAMILTONMS","Cypress, TX",194726,44044,1851,1907,3.0253916801728802,23657.01,24981.58,5.5990592217697799,0,0,0]
[{"$f":"VLOOKUP(C297,Sheet3!$A$1:$C$821,2,FALSE)","v":"Elementary Schools"},"Water","HANCOCKES","Houston, TX",87259,44409,966,931,-3.6231884057971002,8579.2800000000007,8316.99,-3.0572495594035898,0,0,0]
[{"$f":"VLOOKUP(C298,Sheet3!$A$1:$C$821,2,FALSE)","v":"Elementary Schools"},"Water","HEMMENWAYES","Katy, TX",101091,44044,1138,503,-55.799648506151101,9014.7900000000009,4289.0600000000004,-52.421964349696403,0,0,0]
[{"$f":"VLOOKUP(C299,Sheet3!$A$1:$C$821,2,FALSE)","v":"Elementary Schools"},"Water","HOLBROOKES","Houston, TX",99937,367,901,409,-54.605993340732503,11658.23,6482.54,-44.395161186560898,0,0,0]
[{"$f":"VLOOKUP(C300,Sheet3!$A$1:$C$821,2,FALSE)","v":"Elementary Schools"},"Water","HOLMSLEYES","Houston, TX",81704,44044,2796,1028,-63.233190271816902,13168.08,5540.46,-57.925073359214103,0,0,0]
[{"$f":"VLOOKUP(C301,Sheet3!$A$1:$C$821,2,FALSE)","v":"Elementary Schools"},"Water","HOOVERES","Katy, TX",112519,367,518,608,17.374517374517399,6253.8,7276.8,16.358054302983799,0,0,0]
[{"$f":"VLOOKUP(C302,Sheet3!$A$1:$C$821,2,FALSE)","v":"Middle Schools"},"Water","HOPPERMS","Cypress, TX",226178,367,2960,2044,-30.945945945945901,30333.48,21575.360000000001,-28.872783472255701,0,0,0]
[{"$f":"VLOOKUP(C303,Sheet3!$A$1:$C$821,2,FALSE)","v":"Elementary Schools"},"Water","HORNEES","Houston, TX",95855,44409,958,721,-24.7390396659708,7638.26,5982.44,-21.6779737793686,0,0,0]
[{"$f":"VLOOKUP(C304,Sheet3!$A$1:$C$821,2,FALSE)","v":"Administration"},"Water","ISCA","Houston, TX",132467,367,717,665.8,-7.1408647140864696,7490.37,7244.39,-3.2839499250370801,0,0,0]
[{"$f":"VLOOKUP(C305,Sheet3!$A$1:$C$821,2,FALSE)","v":"Administration"},"Water","ISCW","Houston, TX",35364,367,115,104.1,-9.4782608695652204,1263.75,1198.05,-5.1988130563798203,0,0,0]
[{"$f":"VLOOKUP(C306,Sheet3!$A$1:$C$821,2,FALSE)","v":"Administration"},"Water","JARVISCENTRALPLANT","Cypress, TX",12152,367,8279,10015,20.968716028505899,68059.360000000001,86770.6,27.4925300502385,0,0,0]
[{"$f":"VLOOKUP(C307,Sheet3!$A$1:$C$821,2,FALSE)","v":"High Schools"},"Water","JERSEYVILLAGEHS","Houston, TX",513823,44409,2872,352,-87.743732590529206,35409.21,4822.33,-86.381142081396305,0,0,0]
[{"$f":"VLOOKUP(C308,Sheet3!$A$1:$C$821,2,FALSE)","v":"Elementary Schools"},"Water","JOWELLES","Katy, TX",73726,367,415,334,-19.518072289156599,4407.75,3833,-13.0395326413703,0,0,0]
[{"$f":"VLOOKUP(C309,Sheet3!$A$1:$C$821,2,FALSE)","v":"Middle Schools"},"Water","KAHLAMS","Houston, TX",221601,367,1780,2942,65.280898876404507,20141.82,35062.120000000003,74.076225485085303,0,0,0]
[{"$f":"VLOOKUP(C310,Sheet3!$A$1:$C$821,2,FALSE)","v":"Elementary Schools"},"Water","KEITHES","Cypress, TX",95518,367,989,1159,17.1890798786653,7689.15,9402.25,22.279445712465002,0,0,0]
[{"$f":"VLOOKUP(C311,Sheet3!$A$1:$C$821,2,FALSE)","v":"Elementary Schools"},"Water","KIRKES","Houston, TX",93897,367,922,955,3.5791757049891499,8059.9,9044,12.2098289060658,0,0,0]
[{"$f":"VLOOKUP(C312,Sheet3!$A$1:$C$821,2,FALSE)","v":"Middle Schools"},"Water","LABAYMS","Houston, TX",190510,43952,2435,3312,36.016427104722801,23115.75,32186.400000000001,39.240128483825998,0,0,0]
[{"$f":"VLOOKUP(C313,Sheet3!$A$1:$C$821,2,FALSE)","v":"High Schools"},"Water","LANGHAMCREEKHS","Houston, TX",536036,44409,6264,4534,-27.618135376756101,26169.82,20438.21,-21.901602685841901,0,0,0]
[{"$f":"VLOOKUP(C314,Sheet3!$A$1:$C$821,2,FALSE)","v":"Elementary Schools"},"Water","LEEES","Houston, TX",95352,367,1045,888,-15.0239234449761,9209.32,8095.54,-12.0940525467678,0,0,0]
[{"$f":"VLOOKUP(C315,Sheet3!$A$1:$C$821,2,FALSE)","v":"Elementary Schools"},"Water","LIEDERES","Houston, TX",83798,44440,706,578,-18.1303116147309,7371.64,6577.98,-10.766396622732501,0,0,0]
[{"$f":"VLOOKUP(C316,Sheet3!$A$1:$C$821,2,FALSE)","v":"Elementary Schools"},"Water","LOWERYES","Houston, TX",92034,44409,514,568,10.505836575875501,5070.5,5606.6,10.5729218025836,0,0,0]
[{"$f":"VLOOKUP(C317,Sheet3!$A$1:$C$821,2,FALSE)","v":"Administration"},"Water","MAINTENANCEOPER","Houston, TX",36679,43952,243.5,378.1,55.277207392197099,2832.16,4644.28,63.983673238800101,0,0,0]
[{"$f":"VLOOKUP(C318,Sheet3!$A$1:$C$821,2,FALSE)","v":"Elementary Schools"},"Water","MATZKEMILLSES","Houston, TX",127754,44440,1295,1574,21.544401544401499,12260.4,15530.4,26.671234217480698,0,0,0]
[{"$f":"VLOOKUP(C319,Sheet3!$A$1:$C$821,2,FALSE)","v":"Elementary Schools"},"Water","MCFEEES","Katy, TX",105539,367,1301,1146,-11.9139123750961,11268.1,10410.56,-7.61033359661345,0,0,0]
[{"$f":"VLOOKUP(C320,Sheet3!$A$1:$C$821,2,FALSE)","v":"Elementary Schools"},"Water","METCALFES","Houston, TX",85120,43956,641,558,-12.948517940717601,8511.01,6155.98,-27.670393995542199,0,0,0]
[{"$f":"VLOOKUP(C321,Sheet3!$A$1:$C$821,2,FALSE)","v":"Elementary Schools"},"Water","MILLSAPES","Cypress, TX",94477,44409,1289.4000000000001,1041.5999999999999,-19.218241042345301,9013.5,8590.26,-4.6956232318189404,0,0,0]
[{"$f":"VLOOKUP(C322,Sheet3!$A$1:$C$821,2,FALSE)","v":"Elementary Schools"},"Water","MOOREES","Houston, TX",83063,43952,863,704,-18.424101969872499,6745.55,5757.5,-14.647434234421199,0,0,0]
[{"$f":"VLOOKUP(C323,Sheet3!$A$1:$C$821,2,FALSE)","v":"Elementary Schools"},"Water","OWENSES","Houston, TX",87177,44409,824.97,684.58,-17.017588518370399,5544.93,4777.24,-13.8448997552719,0,0,0]
[{"$f":"VLOOKUP(C324,Sheet3!$A$1:$C$821,2,FALSE)","v":"Elementary Schools"},"Water","POPEES","Cypress, TX",112970,367,896,965,7.7008928571428603,8170.4,9037.4500000000007,10.612087535494,0,0,0]
[{"$f":"VLOOKUP(C325,Sheet3!$A$1:$C$821,2,FALSE)","v":"Elementary Schools"},"Water","POSTES","Houston, TX",104852,367,970,820,-15.4639175257732,12259.74,10613.29,-13.4297301574095,0,0,0]
[{"$f":"VLOOKUP(C326,Sheet3!$A$1:$C$821,2,FALSE)","v":"Elementary Schools"},"Water","POSTMAES","Cypress, TX",98920,367,1071,1477,37.908496732026101,8596.52,12132.32,41.130597032287497,0,0,0]
[{"$f":"VLOOKUP(C327,Sheet3!$A$1:$C$821,2,FALSE)","v":"Elementary Schools"},"Water","REEDES","Houston, TX",90012,367,845,795,-5.9171597633136104,5381.15,5112.3,-4.99614394692584,0,0,0]
[{"$f":"VLOOKUP(C328,Sheet3!$A$1:$C$821,2,FALSE)","v":"Elementary Schools"},"Water","RENNELLES","Cypress, TX",118229,44409,756,568,-24.867724867724899,9069.34,7539.92,-16.863630650080399,0,0,0]
[{"$f":"VLOOKUP(C329,Sheet3!$A$1:$C$821,2,FALSE)","v":"Elementary Schools"},"Water","ROBINSONES","Katy, TX",101604,44409,764,828,8.3769633507853403,6457.4,7196.16,11.4405178554836,0,0,0]
[{"$f":"VLOOKUP(C330,Sheet3!$A$1:$C$821,2,FALSE)","v":"Elementary Schools"},"Water","ROBISONES","Cypress, TX",93882,43952,767,541,-29.4654498044329,7620.12,5699.92,-25.1990782297392,0,0,0]
[{"$f":"VLOOKUP(C331,Sheet3!$A$1:$C$821,2,FALSE)","v":"Middle Schools"},"Water","SALYARDSMS","Cypress, TX",247012,44409,1893,2325,22.8209191759113,14333.55,18438.75,28.640497294808299,0,0,0]
[{"$f":"VLOOKUP(C332,Sheet3!$A$1:$C$821,2,FALSE)","v":"Elementary Schools"},"Water","SAMPSONES","Cypress, TX",96096,367,1204,1441,19.684385382059801,8483.4,10446.25,23.137539194191,0,0,0]
[{"$f":"VLOOKUP(C333,Sheet3!$A$1:$C$821,2,FALSE)","v":"Administration"},"Water","SATELLITECOLDFOODWAREHOUSE","Cypress, TX",22020,367,17,21,23.529411764705898,522.91999999999996,549.12,5.01032662739998,0,0,0]
[{"$f":"VLOOKUP(C334,Sheet3!$A$1:$C$821,2,FALSE)","v":"Elementary Schools"},"Water","SHERIDANES","Katy, TX",100760,44409,1035,779,-24.734299516908202,9163.5,7342.44,-19.8729743002128,0,0,0]
[{"$f":"VLOOKUP(C335,Sheet3!$A$1:$C$821,2,FALSE)","v":"Middle Schools"},"Water","SMITHMS","Cypress, TX",234695,44409,916,592,-35.371179039301303,9013.4699999999993,6935.82,-23.050501083378499,0,0,0]
[{"$f":"VLOOKUP(C336,Sheet3!$A$1:$C$821,2,FALSE)","v":"Middle Schools"},"Water","SPILLANEMS","Cypress, TX",235889,367,1271,909,-28.481510621557799,12184.68,9332.16,-23.410709185633099,0,0,0]
[{"$f":"VLOOKUP(C337,Sheet3!$A$1:$C$821,2,FALSE)","v":"Elementary Schools"},"Water","SWENKEES","Cypress, TX",107914,367,1039,924,-11.068334937439801,8056.65,7581,-5.9038185846474596,0,0,0]
[{"$f":"VLOOKUP(C338,Sheet3!$A$1:$C$821,2,FALSE)","v":"Middle Schools"},"Water","THORNTONMS","Katy, TX",202739,44044,4910,3700,-24.643584521384899,40551,31762,-21.6739414564376,0,0,0]
[{"$f":"VLOOKUP(C339,Sheet3!$A$1:$C$821,2,FALSE)","v":"Elementary Schools"},"Water","TIPPSES","Houston, TX",101727,367,972,729,-25,10650.08,8144.23,-23.528931238075199,0,0,0]
[{"$f":"VLOOKUP(C340,Sheet3!$A$1:$C$821,2,FALSE)","v":"Middle Schools"},"Water","TRUITTMS","Houston, TX",209274,43952,3675,2187,-40.4897959183673,28004.44,17182.68,-38.643015179021603,0,0,0]
[{"$f":"VLOOKUP(C341,Sheet3!$A$1:$C$821,2,FALSE)","v":"Elementary Schools"},"Water","WALKERES","Katy, TX",98321,367,1063,622,-41.486359360301002,8440.57,5223.9799999999996,-38.1086822335458,0,0,0]
[{"$f":"VLOOKUP(C342,Sheet3!$A$1:$C$821,2,FALSE)","v":"Elementary Schools"},"Water","WARNERES","Cypress, TX",98451,44044,690,494,-28.405797101449298,7507.92,6229.24,-17.0310818442392,0,0,0]
[{"$f":"VLOOKUP(C343,Sheet3!$A$1:$C$821,2,FALSE)","v":"Middle Schools"},"Water","WATKINSMS","Houston, TX",221773,44409,2480,2958,19.2741935483871,30422.6,37597.78,23.585032180024101,0,0,0]
[{"$f":"VLOOKUP(C344,Sheet3!$A$1:$C$821,2,FALSE)","v":"Elementary Schools"},"Water","WELLSES","Cypress, TX",136702,44409,1158,1532,32.297063903281497,10436.700000000001,14073.97,34.850767004896198,0,0,0]
[{"$f":"VLOOKUP(C345,Sheet3!$A$1:$C$821,2,FALSE)","v":"Administration"},"Water","WESTGREENAGSCIENCECENTER","Cypress, TX",32574,44409,94,5,-94.680851063829806,1047.7,583.70000000000005,-44.2874868760141,0,0,0]
[{"$f":"VLOOKUP(C346,Sheet3!$A$1:$C$821,2,FALSE)","v":"Administration"},"Water","WESTGREENTRANS","Cypress, TX",45340,367,340,294,-13.5294117647059,2596.59,2325.94,-10.423285925001601,0,0,0]
[{"$f":"VLOOKUP(C347,Sheet3!$A$1:$C$821,2,FALSE)","v":"Elementary Schools"},"Water","WILLBERNES","Houston, TX",89993,367,850,711,-16.352941176470601,5494.31,4847.43,-11.773634905930001,0,0,0]
[{"$f":"VLOOKUP(C348,Sheet3!$A$1:$C$821,2,FALSE)","v":"Elementary Schools"},"Water","WILSONES","Houston, TX",86854,44409,721,750,4.0221914008321802,5150.3500000000004,5539.5,7.5557971788325098,0,0,0]
[{"$f":"VLOOKUP(C349,Sheet3!$A$1:$C$821,2,FALSE)","v":"Elementary Schools"},"Water","WOODARDES","Cypress, TX",116974,44044,1148,992,-13.588850174216001,8104.96,7222.76,-10.884692830069501,0,0,0]
[{"$f":"VLOOKUP(C350,Sheet3!$A$1:$C$821,2,FALSE)","v":"Elementary Schools"},"Water","YEAGERES","Houston, TX",99033,44409,712,503,-29.3539325842697,6640.91,4902.26,-26.1808999067899,0,0,0]
[{"$f":"VLOOKUP(C351,Sheet3!$A$1:$C$821,2,FALSE)","v":"Elementary Schools"},"Water","ADAM-ES","Houston, TX",103177,367,413,988,139.22518159806299,4173.5200000000004,10571.03,153.288111713853,0,0,0]
[{"$f":"VLOOKUP(C352,Sheet3!$A$1:$C$821,2,FALSE)","v":"Special Schools"},"Water","ALCWEST","Katy, TX",50839,367,147,211,43.5374149659864,2058.4499999999998,2745.85,33.394058636352597,0,0,0]
[{"$f":"VLOOKUP(C353,Sheet3!$A$1:$C$821,2,FALSE)","v":"Elementary Schools"},"Water","ANDREES","Cypress, TX",100156,43952,854,1517,77.634660421545703,14669.11,18700.060000000001,27.479172219718901,0,0,0]
[{"$f":"VLOOKUP(C354,Sheet3!$A$1:$C$821,2,FALSE)","v":"Middle Schools"},"Water","ANTHONYMS","Cypress, TX",244123,367,1333,1598,19.879969992498101,18185.68,19060.52,4.8105982289361702,0,0,0]
[{"$f":"VLOOKUP(C355,Sheet3!$A$1:$C$821,2,FALSE)","v":"Middle Schools"},"Water","ARAGONMS","Houston, TX",219821,367,1311,2925,123.112128146453,10725.11,24797.52,131.20993630834599,0,0,0]
[{"$f":"VLOOKUP(C356,Sheet3!$A$1:$C$821,2,FALSE)","v":"Elementary Schools"},"Water","AULTES","Cypress, TX",91912,43952,476,0,-100,3918.6,420,-89.281886387995698,0,0,0]
[{"$f":"VLOOKUP(C357,Sheet3!$A$1:$C$821,2,FALSE)","v":"Elementary Schools"},"Water","BANEES","Houston, TX",106804,367,385,1278,231.94805194805201,5754.29,13745.94,138.881599641311,0,0,0]
[{"$f":"VLOOKUP(C358,Sheet3!$A$1:$C$821,2,FALSE)","v":"Elementary Schools"},"Water","BANGES","Houston, TX",89313,44044,537.9,1119.3,108.08700501952001,4974.12,11605.08,133.30920846300501,0,0,0]
[{"$f":"VLOOKUP(C359,Sheet3!$A$1:$C$821,2,FALSE)","v":"Administration"},"Water","BARKERTRANS","Houston, TX",22677,367,412,531,28.883495145631102,1863.45,4158.8500000000004,123.180122890338,0,0,0]
[{"$f":"VLOOKUP(C360,Sheet3!$A$1:$C$821,2,FALSE)","v":"Administration"},"Water","BERRYCENTER","Cypress, TX",491434,367,2407,2197,-8.7245533859576199,23005.41,19841.84,-13.751417601338099,0,0,0]
[{"$f":"VLOOKUP(C361,Sheet3!$A$1:$C$821,2,FALSE)","v":"Elementary Schools"},"Water","BIRKESES","Houston, TX",104952,44044,804,1320,64.179104477611901,6532.57,11253,72.259922205196403,0,0,0]
[{"$f":"VLOOKUP(C362,Sheet3!$A$1:$C$821,2,FALSE)","v":"Elementary Schools"},"Water","BLACKES","Cypress, TX",101992,44409,688,1120,62.790697674418603,8995.43,15116.56,68.047108365025395,0,0,0]
[{"$f":"VLOOKUP(C363,Sheet3!$A$1:$C$821,2,FALSE)","v":"Middle Schools"},"Water","BLEYLMS","Houston, TX",234294,44409,1295,1811,39.845559845559798,10580.12,12616.86,19.250632317969899,0,0,0]
[{"$f":"VLOOKUP(C364,Sheet3!$A$1:$C$821,2,FALSE)","v":"Administration"},"Water","BRADLEYPOLICESTATION","Cypress, TX",19680,43952,64,60,-6.25,413.65,398.5,-3.6625166203311998,0,0,0]
["Special Schools","Water","BRAUTIGAMCENTER","Houston, TX",79751,44409,940.22,1552.84,65.157090893620605,14017.59,12581.13,-10.247553252734599,0,0,0]
[{"$f":"VLOOKUP(C366,Sheet3!$A$1:$C$821,2,FALSE)","v":"High Schools"},"Water","BRIDGELANDHS","Cypress, TX",579612,44409,3554,4593,29.2346651660101,32157.22,42448.160000000003,32.001957880687399,0,0,0]
[{"$f":"VLOOKUP(C367,Sheet3!$A$1:$C$821,2,FALSE)","v":"Middle Schools"},"Water","COOKMS","Houston, TX",205797,43952,1267,1575,24.309392265193399,12640.49,16837.009999999998,33.199029468003197,0,0,0]
[{"$f":"VLOOKUP(C368,Sheet3!$A$1:$C$821,2,FALSE)","v":"Elementary Schools"},"Water","COPELANDES","Houston, TX",91324,44409,768,1612,109.895833333333,8233.7900000000009,13651.54,65.798981999783805,0,0,0]
[{"$f":"VLOOKUP(C369,Sheet3!$A$1:$C$821,2,FALSE)","v":"High Schools"},"Water","CY-CREEKHS","Houston, TX",528099,44409,6455.73,5602.31,-13.219573928897301,54790.41,50593.97,-7.6590775648512199,0,0,0]
[{"$f":"VLOOKUP(C370,Sheet3!$A$1:$C$821,2,FALSE)","v":"Administration"},"Water","CY-FAIRCOMPLEX","Cypress, TX",0,367,7947,10219,28.589404806845401,58449.95,77708.649999999994,32.949044438874601,0,0,0]
[{"$f":"VLOOKUP(C371,Sheet3!$A$1:$C$821,2,FALSE)","v":"High Schools"},"Water","CY-FALLSHS","Houston, TX",565245,44409,2556,3825,49.647887323943699,25975.25,37233.83,43.343490438013099,0,0,0]
[{"$f":"VLOOKUP(C372,Sheet3!$A$1:$C$821,2,FALSE)","v":"High Schools"},"Water","CY-LAKESHS","Katy, TX",514068,43952,4030,4523,12.2332506203474,34475.019999999997,39932.54,15.830360649537001,0,0,0]
[{"$f":"VLOOKUP(C373,Sheet3!$A$1:$C$821,2,FALSE)","v":"High Schools"},"Water","CY-PARKHS","Cypress, TX",590057,367,4074,5006,22.876779577810499,32713.88,41411.800000000003,26.587858120161801,0,0,0]
[{"$f":"VLOOKUP(C374,Sheet3!$A$1:$C$821,2,FALSE)","v":"High Schools"},"Water","CY-RANCHHS","Cypress, TX",527481,44409,3585,4264,18.9400278940028,38152.35,48711.55,27.676407875268499,0,0,0]
[{"$f":"VLOOKUP(C375,Sheet3!$A$1:$C$821,2,FALSE)","v":"High Schools"},"Water","CY-RIDGEHS","Houston, TX",502564,44044,2884,4193,45.388349514563103,20674.169999999998,33383.07,61.472358987083901,0,0,0]
[{"$f":"VLOOKUP(C376,Sheet3!$A$1:$C$821,2,FALSE)","v":"High Schools"},"Water","CY-SPRINGSHS","Cypress, TX",478615,44044,7013,7936,13.161271923570499,73734.679999999993,85360.320000000007,15.766854891076999,0,0,0]
[{"$f":"VLOOKUP(C377,Sheet3!$A$1:$C$821,2,FALSE)","v":"High Schools"},"Water","CY-WOODSHS","Cypress, TX",501359,44409,1810,1803,-0.386740331491713,17804.080000000002,19794.580000000002,11.1800216579571,0,0,0]
[{"$f":"VLOOKUP(C378,Sheet3!$A$1:$C$821,2,FALSE)","v":"Elementary Schools"},"Water","DANISHES","Houston, TX",98052,43952,716,1443,101.536312849162,7221.79,15440.79,113.808349453529,0,0,0]
[{"$f":"VLOOKUP(C379,Sheet3!$A$1:$C$821,2,FALSE)","v":"Middle Schools"},"Water","DEANMS","Houston, TX",222788,44044,1601,3463,116.30231105559,18716.810000000001,41353.47,120.94293846013301,0,0,0]
[{"$f":"VLOOKUP(C380,Sheet3!$A$1:$C$821,2,FALSE)","v":"Elementary Schools"},"Water","DURYEAES","Katy, TX",96423,43952,635,948,49.291338582677199,6938.5,10427.76,50.288390862578403,0,0,0]
[{"$f":"VLOOKUP(C381,Sheet3!$A$1:$C$821,2,FALSE)","v":"Administration"},"Water","ELC1","Houston, TX",6832,367,37.799999999999997,77.900000000000006,106.084656084656,530.08000000000004,931.43,75.714986417144601,0,0,0]
[{"$f":"VLOOKUP(C382,Sheet3!$A$1:$C$821,2,FALSE)","v":"Administration"},"Water","ELC2","Houston, TX",4573,367,140,127,-9.2857142857142794,960,835.06,-13.014583333333301,0,0,0]
[{"$f":"VLOOKUP(C383,Sheet3!$A$1:$C$821,2,FALSE)","v":"Administration"},"Water","ELDRIDGETRANS","Houston, TX",26451,44409,510,916,79.607843137254903,4003.5,7419.6,85.327838141626103,0,0,0]
[{"$f":"VLOOKUP(C384,Sheet3!$A$1:$C$821,2,FALSE)","v":"Elementary Schools"},"Water","EMERYES","Katy, TX",98438,44044,643,1144,77.916018662519406,6071.68,10617.36,74.866923158005704,0,0,0]
[{"$f":"VLOOKUP(C385,Sheet3!$A$1:$C$821,2,FALSE)","v":"Elementary Schools"},"Water","EMMOTTES","Houston, TX",77394,43952,818,1428,74.572127139364298,5798.7,10385,79.091865418110999,0,0,0]
[{"$f":"VLOOKUP(C386,Sheet3!$A$1:$C$821,2,FALSE)","v":"Administration"},"Water","FALCONCOMPLEX","Houston, TX",0,367,4522,15357.3,239.61300309597499,56024.17,199419.29,255.95224346920301,0,0,0]
[{"$f":"VLOOKUP(C387,Sheet3!$A$1:$C$821,2,FALSE)","v":"Elementary Schools"},"Water","FARNEYES","Cypress, TX",95036,367,666,2108,216.51651651651699,6705.36,21160.02,215.56873903862001,0,0,0]
[{"$f":"VLOOKUP(C388,Sheet3!$A$1:$C$821,2,FALSE)","v":"Elementary Schools"},"Water","FIESTES","Houston, TX",96117,44409,517,1933,273.88781431334598,9611.75,18370.29,91.123260592503996,0,0,0]
[{"$f":"VLOOKUP(C389,Sheet3!$A$1:$C$821,2,FALSE)","v":"Elementary Schools"},"Water","FRANCONEES","Houston, TX",88982,44409,417,1441,245.56354916067099,2844.89,10352.35,263.89280429120299,0,0,0]
[{"$f":"VLOOKUP(C390,Sheet3!$A$1:$C$821,2,FALSE)","v":"Elementary Schools"},"Water","FRAZIERES","Houston, TX",88177,44409,255,480,88.235294117647101,1440.75,2301.9,59.770952628839098,0,0,0]
[{"$f":"VLOOKUP(C391,Sheet3!$A$1:$C$821,2,FALSE)","v":"Elementary Schools"},"Water","GLEASONES","Houston, TX",91424,367,624.74,1167.7829999999999,86.923039984633604,4657.76,9457.2999999999993,103.043952457834,0,0,0]
[{"$f":"VLOOKUP(C392,Sheet3!$A$1:$C$821,2,FALSE)","v":"Middle Schools"},"Water","GOODSONMS","Cypress, TX",218801,367,1233,2097,70.072992700729898,11925.96,21233.279999999999,78.042522362979597,0,0,0]
[{"$f":"VLOOKUP(C393,Sheet3!$A$1:$C$821,2,FALSE)","v":"Elementary Schools"},"Water","HAIRGROVEES","Houston, TX",90830,44409,525,1110,111.428571428571,5557.7,11801.03,112.336578080861,0,0,0]
[{"$f":"VLOOKUP(C394,Sheet3!$A$1:$C$821,2,FALSE)","v":"Elementary Schools"},"Water","HAMILTONES","Cypress, TX",89692,44044,250,1019,307.60000000000002,4676,12143.14,159.69076133447399,0,0,0]
[{"$f":"VLOOKUP(C395,Sheet3!$A$1:$C$821,2,FALSE)","v":"Middle Schools"},"Water","HAMILTONMS","Cypress, TX",194726,44044,1200,1113,-7.25,17791.5,17746.86,-0.25090633167523801,0,0,0]
[{"$f":"VLOOKUP(C396,Sheet3!$A$1:$C$821,2,FALSE)","v":"Elementary Schools"},"Water","HANCOCKES","Houston, TX",87259,44409,539,885,64.192949907235601,6697.48,8937.43,33.444668741078701,0,0,0]
[{"$f":"VLOOKUP(C397,Sheet3!$A$1:$C$821,2,FALSE)","v":"Elementary Schools"},"Water","HEMMENWAYES","Katy, TX",101091,44044,553,1108,100.361663652803,4662.66,9413,101.880471662098,0,0,0]
[{"$f":"VLOOKUP(C398,Sheet3!$A$1:$C$821,2,FALSE)","v":"Elementary Schools"},"Water","HOLBROOKES","Houston, TX",99937,367,590,780,32.203389830508499,8284.93,10763.91,29.921556368007899,0,0,0]
[{"$f":"VLOOKUP(C399,Sheet3!$A$1:$C$821,2,FALSE)","v":"Elementary Schools"},"Water","HOLMSLEYES","Houston, TX",81704,44044,804,1084,34.825870646766198,4382.99,10776.76,145.87690138467099,0,0,0]
[{"$f":"VLOOKUP(C400,Sheet3!$A$1:$C$821,2,FALSE)","v":"Elementary Schools"},"Water","HOOVERES","Katy, TX",112519,367,249,542,117.670682730924,4206.3999999999996,6742.2,60.284328642069198,0,0,0]
[{"$f":"VLOOKUP(C401,Sheet3!$A$1:$C$821,2,FALSE)","v":"Middle Schools"},"Water","HOPPERMS","Cypress, TX",226178,367,2274,1135,-50.087950747581402,23918.639999999999,12413.7,-48.100310051073102,0,0,0]
[{"$f":"VLOOKUP(C402,Sheet3!$A$1:$C$821,2,FALSE)","v":"Elementary Schools"},"Water","HORNEES","Houston, TX",95855,44409,563,1063,88.809946714031994,4775.32,8901.07,86.3973513816875,0,0,0]
[{"$f":"VLOOKUP(C403,Sheet3!$A$1:$C$821,2,FALSE)","v":"Administration"},"Water","ISCA","Houston, TX",132467,367,439.9,648,47.306205955899102,4608.38,7094.88,53.956053971243698,0,0,0]
[{"$f":"VLOOKUP(C404,Sheet3!$A$1:$C$821,2,FALSE)","v":"Administration"},"Water","ISCW","Houston, TX",35364,367,70.599999999999994,193.2,173.654390934844,809.56,2422.11,199.188448045852,0,0,0]
[{"$f":"VLOOKUP(C405,Sheet3!$A$1:$C$821,2,FALSE)","v":"Administration"},"Water","JARVISCENTRALPLANT","Cypress, TX",12152,367,4826,6030,24.948197264815601,39606.639999999999,53861.16,35.990227901180198,0,0,0]
[{"$f":"VLOOKUP(C406,Sheet3!$A$1:$C$821,2,FALSE)","v":"High Schools"},"Water","JERSEYVILLAGEHS","Houston, TX",513823,44409,1527,269,-82.383759004584107,19071.330000000002,3872.93,-79.692396912014004,0,0,0]
[{"$f":"VLOOKUP(C407,Sheet3!$A$1:$C$821,2,FALSE)","v":"Elementary Schools"},"Water","JOWELLES","Katy, TX",73726,367,177,376,112.429378531073,2642.7,4578.1000000000004,73.235705906837694,0,0,0]
[{"$f":"VLOOKUP(C408,Sheet3!$A$1:$C$821,2,FALSE)","v":"Middle Schools"},"Water","KAHLAMS","Houston, TX",221601,367,1362,1488,9.2511013215858995,15675.12,17448.099999999999,11.3107906031979,0,0,0]
[{"$f":"VLOOKUP(C409,Sheet3!$A$1:$C$821,2,FALSE)","v":"Elementary Schools"},"Water","KEITHES","Cypress, TX",95518,367,545,1453,166.60550458715599,4425.75,11902.65,168.94085748178301,0,0,0]
[{"$f":"VLOOKUP(C410,Sheet3!$A$1:$C$821,2,FALSE)","v":"Elementary Schools"},"Water","KIRKES","Houston, TX",93897,367,705,1053,49.361702127659598,6669,10346.450000000001,55.142450142450102,0,0,0]
[{"$f":"VLOOKUP(C411,Sheet3!$A$1:$C$821,2,FALSE)","v":"Middle Schools"},"Water","LABAYMS","Houston, TX",190510,43952,1502,1974,31.4247669773635,14569.4,19908.7,36.647356788886299,0,0,0]
[{"$f":"VLOOKUP(C412,Sheet3!$A$1:$C$821,2,FALSE)","v":"High Schools"},"Water","LANGHAMCREEKHS","Houston, TX",536036,44409,3790,2282,-39.788918205804698,16415.77,20560.099999999999,25.246028666337299,0,0,0]
[{"$f":"VLOOKUP(C413,Sheet3!$A$1:$C$821,2,FALSE)","v":"Elementary Schools"},"Water","LEEES","Houston, TX",95352,367,524,798,52.290076335877899,4882.72,7495.92,53.519349870564,0,0,0]
[{"$f":"VLOOKUP(C414,Sheet3!$A$1:$C$821,2,FALSE)","v":"Elementary Schools"},"Water","LIEDERES","Houston, TX",83798,44440,804,698,-13.18407960199,9423.99,7714.77,-18.136903795526099,0,0,0]
[{"$f":"VLOOKUP(C415,Sheet3!$A$1:$C$821,2,FALSE)","v":"Elementary Schools"},"Water","LOWERYES","Houston, TX",92034,44409,343,984,186.880466472303,3327.1,9557.2000000000007,187.25316341558701,0,0,0]
[{"$f":"VLOOKUP(C416,Sheet3!$A$1:$C$821,2,FALSE)","v":"Administration"},"Water","MAINTENANCEOPER","Houston, TX",36679,43952,297.60000000000002,401.6,34.946236559139798,3545.36,5048.1000000000004,42.386104655098499,0,0,0]
[{"$f":"VLOOKUP(C417,Sheet3!$A$1:$C$821,2,FALSE)","v":"Elementary Schools"},"Water","MATZKEMILLSES","Houston, TX",127754,44440,699,2194,213.876967095851,6794.88,22155.24,226.05785532636301,0,0,0]
[{"$f":"VLOOKUP(C418,Sheet3!$A$1:$C$821,2,FALSE)","v":"Elementary Schools"},"Water","MCFEEES","Katy, TX",105539,367,616,5304,761.03896103896102,5850.38,46485.96,694.58018111644003,0,0,0]
[{"$f":"VLOOKUP(C419,Sheet3!$A$1:$C$821,2,FALSE)","v":"Elementary Schools"},"Water","METCALFES","Houston, TX",85120,43956,418,576,37.799043062201001,4540.53,6390.24,40.737755284074801,0,0,0]
[{"$f":"VLOOKUP(C420,Sheet3!$A$1:$C$821,2,FALSE)","v":"Elementary Schools"},"Water","MILLSAPES","Cypress, TX",94477,44409,459.1,1348.1,193.639729906338,6425.1,10089.07,57.025882865636298,0,0,0]
[{"$f":"VLOOKUP(C421,Sheet3!$A$1:$C$821,2,FALSE)","v":"Elementary Schools"},"Water","MOOREES","Houston, TX",83063,43952,376,646,71.808510638297903,2919.55,6394.88,119.036495350311,0,0,0]
[{"$f":"VLOOKUP(C422,Sheet3!$A$1:$C$821,2,FALSE)","v":"Elementary Schools"},"Water","OWENSES","Houston, TX",87177,44409,442.13,779.74,76.359894148779802,3081.09,5645.75,83.238723958079802,0,0,0]
[{"$f":"VLOOKUP(C423,Sheet3!$A$1:$C$821,2,FALSE)","v":"Elementary Schools"},"Water","POPEES","Cypress, TX",112970,367,527,1037,96.774193548387103,5126.1099999999997,9877.44,92.688803010469897,0,0,0]
[{"$f":"VLOOKUP(C424,Sheet3!$A$1:$C$821,2,FALSE)","v":"Elementary Schools"},"Water","POSTES","Houston, TX",104852,367,569,810,42.3550087873462,7393.31,10662.48,44.217948388475499,0,0,0]
[{"$f":"VLOOKUP(C425,Sheet3!$A$1:$C$821,2,FALSE)","v":"Elementary Schools"},"Water","POSTMAES","Cypress, TX",98920,367,582,2235,284.02061855670098,4763.97,18913.72,297.01593418934198,0,0,0]
[{"$f":"VLOOKUP(C426,Sheet3!$A$1:$C$821,2,FALSE)","v":"Elementary Schools"},"Water","REEDES","Houston, TX",90012,367,410,810,97.560975609756099,2697.9,5286.06,95.932391860335798,0,0,0]
[{"$f":"VLOOKUP(C427,Sheet3!$A$1:$C$821,2,FALSE)","v":"Elementary Schools"},"Water","RENNELLES","Cypress, TX",118229,44409,367,732,99.4550408719346,6808.32,8922.68,31.055532054897501,0,0,0]
[{"$f":"VLOOKUP(C428,Sheet3!$A$1:$C$821,2,FALSE)","v":"Elementary Schools"},"Water","ROBINSONES","Katy, TX",101604,44409,454,857,88.766519823788499,4084.48,7677.4,87.9651754935757,0,0,0]
[{"$f":"VLOOKUP(C429,Sheet3!$A$1:$C$821,2,FALSE)","v":"Elementary Schools"},"Water","ROBISONES","Cypress, TX",93882,43952,396,715,80.5555555555556,4263.9799999999996,7495.38,75.783657521845797,0,0,0]
[{"$f":"VLOOKUP(C430,Sheet3!$A$1:$C$821,2,FALSE)","v":"Middle Schools"},"Water","SALYARDSMS","Cypress, TX",247012,44409,934,1855,98.608137044967904,7284.9,15185.45,108.45104256750299,0,0,0]
[{"$f":"VLOOKUP(C431,Sheet3!$A$1:$C$821,2,FALSE)","v":"Elementary Schools"},"Water","SAMPSONES","Cypress, TX",96096,367,846,1122,32.624113475177303,6465.1,8727.25,34.990178032822399,0,0,0]
[{"$f":"VLOOKUP(C432,Sheet3!$A$1:$C$821,2,FALSE)","v":"Administration"},"Water","SATELLITECOLDFOODWAREHOUSE","Cypress, TX",22020,367,42,19,-54.761904761904802,715.62,541.54,-24.325759481289001,0,0,0]
[{"$f":"VLOOKUP(C433,Sheet3!$A$1:$C$821,2,FALSE)","v":"Elementary Schools"},"Water","SHERIDANES","Katy, TX",100760,44409,819,1429,74.481074481074501,7542,13063.14,73.205250596658701,0,0,0]
[{"$f":"VLOOKUP(C434,Sheet3!$A$1:$C$821,2,FALSE)","v":"Middle Schools"},"Water","SMITHMS","Cypress, TX",234695,44409,570,877,53.859649122806999,6803.2,9225.36,35.603245531514602,0,0,0]
[{"$f":"VLOOKUP(C435,Sheet3!$A$1:$C$821,2,FALSE)","v":"Middle Schools"},"Water","SPILLANEMS","Cypress, TX",235889,367,707,1055,49.222065063649197,7065.72,10960.7,55.125026182752798,0,0,0]
[{"$f":"VLOOKUP(C436,Sheet3!$A$1:$C$821,2,FALSE)","v":"Elementary Schools"},"Water","SWENKEES","Cypress, TX",107914,367,477,1139,138.78406708595401,3925.95,9451.2999999999993,140.739184146512,0,0,0]
[{"$f":"VLOOKUP(C437,Sheet3!$A$1:$C$821,2,FALSE)","v":"Middle Schools"},"Water","THORNTONMS","Katy, TX",202739,44044,1949,1829,-6.15700359158543,16959.419999999998,16501.259999999998,-2.7015074807982802,0,0,0]
[{"$f":"VLOOKUP(C438,Sheet3!$A$1:$C$821,2,FALSE)","v":"Elementary Schools"},"Water","TIPPSES","Houston, TX",101727,367,539,720,33.5807050092764,5976.94,8179.83,36.8564850910332,0,0,0]
[{"$f":"VLOOKUP(C439,Sheet3!$A$1:$C$821,2,FALSE)","v":"Middle Schools"},"Water","TRUITTMS","Houston, TX",209274,43952,1355,1382,1.9926199261992601,10826.2,11377.98,5.0967098335519401,0,0,0]
[{"$f":"VLOOKUP(C440,Sheet3!$A$1:$C$821,2,FALSE)","v":"Elementary Schools"},"Water","WALKERES","Katy, TX",98321,367,467,983,110.492505353319,3981.54,8347,109.642500138138,0,0,0]
[{"$f":"VLOOKUP(C441,Sheet3!$A$1:$C$821,2,FALSE)","v":"Elementary Schools"},"Water","WARNERES","Cypress, TX",98451,44044,344,642,86.6279069767442,5300.49,7502.14,41.536725849874301,0,0,0]
[{"$f":"VLOOKUP(C442,Sheet3!$A$1:$C$821,2,FALSE)","v":"Middle Schools"},"Water","WATKINSMS","Houston, TX",221773,44409,1720,1428,-16.976744186046499,20518.099999999999,17362.169999999998,-15.381200013646501,0,0,0]
[{"$f":"VLOOKUP(C443,Sheet3!$A$1:$C$821,2,FALSE)","v":"Elementary Schools"},"Water","WELLSES","Cypress, TX",136702,44409,1190,1444,21.344537815125999,11046.7,13589.28,23.016647505589901,0,0,0]
[{"$f":"VLOOKUP(C444,Sheet3!$A$1:$C$821,2,FALSE)","v":"Administration"},"Water","WESTGREENAGSCIENCECENTER","Cypress, TX",32574,44409,39,4,-89.743589743589794,766.18,581.29999999999995,-24.130099976506798,0,0,0]
[{"$f":"VLOOKUP(C445,Sheet3!$A$1:$C$821,2,FALSE)","v":"Administration"},"Water","WESTGREENTRANS","Cypress, TX",45340,367,239,355,48.535564853556501,1887.28,2897.4,53.522529778305298,0,0,0]
[{"$f":"VLOOKUP(C446,Sheet3!$A$1:$C$821,2,FALSE)","v":"Elementary Schools"},"Water","WILLBERNES","Houston, TX",89993,367,493,655,32.860040567951302,3539.22,4605.0200000000004,30.113979916478801,0,0,0]
[{"$f":"VLOOKUP(C447,Sheet3!$A$1:$C$821,2,FALSE)","v":"Elementary Schools"},"Water","WILSONES","Houston, TX",86854,44409,909,947,4.1804180418041801,6693.15,7209.2,7.7101215421737104,0,0,0]
[{"$f":"VLOOKUP(C448,Sheet3!$A$1:$C$821,2,FALSE)","v":"Elementary Schools"},"Water","WOODARDES","Cypress, TX",116974,44044,667,1166,74.812593703148394,4803.51,8835.64,83.941326238521398,0,0,0]
[{"$f":"VLOOKUP(C449,Sheet3!$A$1:$C$821,2,FALSE)","v":"Elementary Schools"},"Water","YEAGERES","Houston, TX",99033,44409,423,560,32.387706855791997,3783.24,6265.86,65.6215307514194,0,0,0]
[{"$f":"VLOOKUP(C450,Sheet3!$A$1:$C$821,2,FALSE)","v":"Special Schools"},"Irrigation","ALCWEST","Katy, TX",50839,367,36,170,372.222222222222,338.1,1122.5,232.002366163857,0,0,0]
[{"$f":"VLOOKUP(C451,Sheet3!$A$1:$C$821,2,FALSE)","v":"Elementary Schools"},"Irrigation","ANDREES","Cypress, TX",100156,43952,390,18,-95.384615384615401,2116.94,209.52,-90.102695399964105,0,0,0]
[{"$f":"VLOOKUP(C452,Sheet3!$A$1:$C$821,2,FALSE)","v":"Middle Schools"},"Irrigation","ANTHONYMS","Cypress, TX",244123,367,3378,1732,-48.727057430432197,24274.38,12899.48,-46.859693223884598,0,0,0]
[{"$f":"VLOOKUP(C453,Sheet3!$A$1:$C$821,2,FALSE)","v":"Middle Schools"},"Irrigation","ARAGONMS","Houston, TX",219821,367,223,649,191.031390134529,1360.57,4029.84,196.18762724446401,0,0,0]
[{"$f":"VLOOKUP(C454,Sheet3!$A$1:$C$821,2,FALSE)","v":"Administration"},"Irrigation","BERRYCENTER","Cypress, TX",491434,367,4324,3929,-9.1350601295097107,25646.3,24364.31,-4.99873276067113,0,0,0]
[{"$f":"VLOOKUP(C455,Sheet3!$A$1:$C$821,2,FALSE)","v":"Elementary Schools"},"Irrigation","BIRKESES","Houston, TX",104952,44044,52,14,-73.076923076923094,321.23,133.44,-58.459670640973798,0,0,0]
[{"$f":"VLOOKUP(C456,Sheet3!$A$1:$C$821,2,FALSE)","v":"Elementary Schools"},"Irrigation","BLACKES","Cypress, TX",101992,44409,44,133,202.272727272727,546.9,1436.92,162.73907478515301,0,0,0]
[{"$f":"VLOOKUP(C457,Sheet3!$A$1:$C$821,2,FALSE)","v":"Administration"},"Irrigation","BRADLEYPOLICESTATION","Cypress, TX",19680,43952,10,0,-100,93.75,54,-42.4,0,0,0]
[{"$f":"VLOOKUP(C458,Sheet3!$A$1:$C$821,2,FALSE)","v":"High Schools"},"Irrigation","BRIDGELANDHS","Cypress, TX",579612,44409,8363,8447,1.0044242496711699,50772.01,54374.21,7.0948540347329203,0,0,0]
[{"$f":"VLOOKUP(C459,Sheet3!$A$1:$C$821,2,FALSE)","v":"Middle Schools"},"Irrigation","COOKMS","Houston, TX",205797,43952,367,776.3,111.525885558583,2677.51,6389.42,138.63290893404701,0,0,0]
[{"$f":"VLOOKUP(C460,Sheet3!$A$1:$C$821,2,FALSE)","v":"High Schools"},"Irrigation","CY-FALLSHS","Houston, TX",565245,44409,889,1684,89.426321709786293,5927.12,12194.68,105.74376763082201,0,0,0]
[{"$f":"VLOOKUP(C461,Sheet3!$A$1:$C$821,2,FALSE)","v":"High Schools"},"Irrigation","CY-LAKESHS","Katy, TX",514068,43952,4613,5868,27.205722956860999,26087.8,34641.480000000003,32.788046519829201,0,0,0]
[{"$f":"VLOOKUP(C462,Sheet3!$A$1:$C$821,2,FALSE)","v":"High Schools"},"Irrigation","CY-PARKHS","Cypress, TX",590057,367,5639,6151,9.0796240468168108,35166.800000000003,40353.699999999997,14.749422751003801,0,0,0]
[{"$f":"VLOOKUP(C463,Sheet3!$A$1:$C$821,2,FALSE)","v":"High Schools"},"Irrigation","CY-RANCHHS","Cypress, TX",527481,44409,5462,2340,-57.158549981691699,29941.98,13620.9,-54.509020445541701,0,0,0]
[{"$f":"VLOOKUP(C464,Sheet3!$A$1:$C$821,2,FALSE)","v":"High Schools"},"Irrigation","CY-RIDGEHS","Houston, TX",502564,44044,3373,2009,-40.438778535428398,15530.8,9758.65,-37.165825327735902,0,0,0]
[{"$f":"VLOOKUP(C465,Sheet3!$A$1:$C$821,2,FALSE)","v":"High Schools"},"Irrigation","CY-SPRINGSHS","Cypress, TX",478615,44044,4405,4367,-0.86265607264472199,29134.1,30034.84,3.0917035364057899,0,0,0]
[{"$f":"VLOOKUP(C466,Sheet3!$A$1:$C$821,2,FALSE)","v":"High Schools"},"Irrigation","CY-WOODSHS","Cypress, TX",501359,44409,5617,4566,-18.7110557236959,46274.48,39313.68,-15.042416467997,0,0,0]
[{"$f":"VLOOKUP(C467,Sheet3!$A$1:$C$821,2,FALSE)","v":"Elementary Schools"},"Irrigation","DANISHES","Houston, TX",98052,43952,0,547,0,217.08,3674.96,1592.9058411645501,0,0,0]
[{"$f":"VLOOKUP(C468,Sheet3!$A$1:$C$821,2,FALSE)","v":"Middle Schools"},"Irrigation","DEANMS","Houston, TX",222788,44044,988,648,-34.412955465586997,8153.54,6129.33,-24.826149132769299,0,0,0]
[{"$f":"VLOOKUP(C469,Sheet3!$A$1:$C$821,2,FALSE)","v":"Elementary Schools"},"Irrigation","DURYEAES","Katy, TX",96423,43952,422,951,125.355450236967,2785.2,6538.42,134.75585236248699,0,0,0]
[{"$f":"VLOOKUP(C470,Sheet3!$A$1:$C$821,2,FALSE)","v":"Administration"},"Irrigation","ELDRIDGETRANS","Houston, TX",26451,44409,1,960,95900,183.35,4761,2496.6730297245699,0,0,0]
[{"$f":"VLOOKUP(C471,Sheet3!$A$1:$C$821,2,FALSE)","v":"Elementary Schools"},"Irrigation","EMERYES","Katy, TX",98438,44044,0,353,0,330,2336.08,607.90303030303005,0,0,0]
[{"$f":"VLOOKUP(C472,Sheet3!$A$1:$C$821,2,FALSE)","v":"Elementary Schools"},"Irrigation","FARNEYES","Cypress, TX",95036,367,335,925,176.119402985075,2710.4,7884.6,190.90171192443901,0,0,0]
[{"$f":"VLOOKUP(C473,Sheet3!$A$1:$C$821,2,FALSE)","v":"Elementary Schools"},"Irrigation","GLEASONES","Houston, TX",91424,367,0,21.523,0,90,204.37,127.077777777778,0,0,0]
[{"$f":"VLOOKUP(C474,Sheet3!$A$1:$C$821,2,FALSE)","v":"Middle Schools"},"Irrigation","GOODSONMS","Cypress, TX",218801,367,2016,1374,-31.845238095238098,16452.240000000002,11772.32,-28.445488273937201,0,0,0]
[{"$f":"VLOOKUP(C475,Sheet3!$A$1:$C$821,2,FALSE)","v":"Middle Schools"},"Irrigation","HAMILTONMS","Cypress, TX",194726,44044,2025,2530,24.938271604938301,13284.63,20994.45,58.035639682851503,0,0,0]
[{"$f":"VLOOKUP(C476,Sheet3!$A$1:$C$821,2,FALSE)","v":"Elementary Schools"},"Irrigation","HEMMENWAYES","Katy, TX",101091,44044,388,543,39.948453608247398,2367,3442.5,45.437262357414397,0,0,0]
[{"$f":"VLOOKUP(C477,Sheet3!$A$1:$C$821,2,FALSE)","v":"Elementary Schools"},"Irrigation","HOOVERES","Katy, TX",112519,367,1077,765,-28.969359331476301,8465.9500000000007,5540.5,-34.555484027191298,0,0,0]
[{"$f":"VLOOKUP(C478,Sheet3!$A$1:$C$821,2,FALSE)","v":"Middle Schools"},"Irrigation","HOPPERMS","Cypress, TX",226178,367,1780,1742,-2.1348314606741599,11784.4,11965.72,1.53864430942602,0,0,0]
[{"$f":"VLOOKUP(C479,Sheet3!$A$1:$C$821,2,FALSE)","v":"Administration"},"Irrigation","ISCW","Houston, TX",35364,367,53.9,0,-100,433.92,144,-66.814159292035399,0,0,0]
[{"$f":"VLOOKUP(C480,Sheet3!$A$1:$C$821,2,FALSE)","v":"Administration"},"Irrigation","JERSEYVILLAGESTADIUM","Houston, TX",2385,367,1744,1619,-7.1674311926605503,12118.14,11428.9,-5.6876715403519,0,0,0]
[{"$f":"VLOOKUP(C481,Sheet3!$A$1:$C$821,2,FALSE)","v":"Elementary Schools"},"Irrigation","JOWELLES","Katy, TX",73726,367,811,634,-21.8249075215783,6264.35,4290.3999999999996,-31.510851085906801,0,0,0]
[{"$f":"VLOOKUP(C482,Sheet3!$A$1:$C$821,2,FALSE)","v":"Middle Schools"},"Irrigation","KAHLAMS","Houston, TX",221601,367,2374,1708,-28.053917438921701,19524.64,13935.04,-28.6284407804702,0,0,0]
[{"$f":"VLOOKUP(C483,Sheet3!$A$1:$C$821,2,FALSE)","v":"Elementary Schools"},"Irrigation","KEITHES","Cypress, TX",95518,367,378,333,-11.9047619047619,2249.1,2114.5500000000002,-5.9823929571828698,0,0,0]
[{"$f":"VLOOKUP(C484,Sheet3!$A$1:$C$821,2,FALSE)","v":"Elementary Schools"},"Irrigation","KIRKES","Houston, TX",93897,367,127,177,39.370078740157503,662.35,915.7,38.250169849777301,0,0,0]
[{"$f":"VLOOKUP(C485,Sheet3!$A$1:$C$821,2,FALSE)","v":"High Schools"},"Irrigation","LANGHAMCREEKHS","Houston, TX",536036,44409,3979,4620,16.109575270168399,26077.13,30897.35,18.484472792826502,0,0,0]
[{"$f":"VLOOKUP(C486,Sheet3!$A$1:$C$821,2,FALSE)","v":"Elementary Schools"},"Irrigation","LEEES","Houston, TX",95352,367,1130,1238,9.5575221238938006,6860.6,7793.66,13.600268198116799,0,0,0]
[{"$f":"VLOOKUP(C487,Sheet3!$A$1:$C$821,2,FALSE)","v":"Elementary Schools"},"Irrigation","LOWERYES","Houston, TX",92034,44409,435,0,-100,1907.25,30,-98.427054659850597,0,0,0]
[{"$f":"VLOOKUP(C488,Sheet3!$A$1:$C$821,2,FALSE)","v":"Elementary Schools"},"Irrigation","MATZKEMILLSES","Houston, TX",127754,44440,335,176,-47.462686567164198,2093.1999999999998,1132.5999999999999,-45.891458054653199,0,0,0]
[{"$f":"VLOOKUP(C489,Sheet3!$A$1:$C$821,2,FALSE)","v":"Elementary Schools"},"Irrigation","MCFEEES","Katy, TX",105539,367,1009,706,-30.029732408325099,6260.4,4734.66,-24.371286179796801,0,0,0]
[{"$f":"VLOOKUP(C490,Sheet3!$A$1:$C$821,2,FALSE)","v":"Elementary Schools"},"Irrigation","POPEES","Cypress, TX",112970,367,1099,1011,-8.0072793448589596,6826.35,6530.73,-4.3305719747742204,0,0,0]
[{"$f":"VLOOKUP(C491,Sheet3!$A$1:$C$821,2,FALSE)","v":"Elementary Schools"},"Irrigation","POSTMAES","Cypress, TX",98920,367,168,46,-72.619047619047606,960.66,296.66000000000003,-69.119147252930304,0,0,0]
[{"$f":"VLOOKUP(C492,Sheet3!$A$1:$C$821,2,FALSE)","v":"Elementary Schools"},"Irrigation","RENNELLES","Cypress, TX",118229,44409,1581,18,-98.861480075901298,11357.43,222.4,-98.041810515231006,0,0,0]
[{"$f":"VLOOKUP(C493,Sheet3!$A$1:$C$821,2,FALSE)","v":"Elementary Schools"},"Irrigation","ROBINSONES","Katy, TX",101604,44409,1081,770,-28.769657724329299,6843.25,4562,-33.335768823293002,0,0,0]
[{"$f":"VLOOKUP(C494,Sheet3!$A$1:$C$821,2,FALSE)","v":"Elementary Schools"},"Irrigation","ROBISONES","Cypress, TX",93882,43952,7,9,28.571428571428601,179.68,197.82,10.0957257346394,0,0,0]
[{"$f":"VLOOKUP(C495,Sheet3!$A$1:$C$821,2,FALSE)","v":"Middle Schools"},"Irrigation","SALYARDSMS","Cypress, TX",247012,44409,797,3139,293.851944792974,4742.1499999999996,19932.650000000001,320.32938645972803,0,0,0]
[{"$f":"VLOOKUP(C496,Sheet3!$A$1:$C$821,2,FALSE)","v":"Elementary Schools"},"Irrigation","SAMPSONES","Cypress, TX",96096,367,53,105,98.113207547169793,257.05,551.25,114.45244115930799,0,0,0]
[{"$f":"VLOOKUP(C497,Sheet3!$A$1:$C$821,2,FALSE)","v":"Administration"},"Irrigation","SATELLITECOLDFOODWAREHOUSE","Cypress, TX",22020,367,158,1,-99.367088607594894,1183.92,154.68,-86.934928035678098,0,0,0]
[{"$f":"VLOOKUP(C498,Sheet3!$A$1:$C$821,2,FALSE)","v":"Middle Schools"},"Irrigation","SMITHMS","Cypress, TX",234695,44409,1637,2172,32.681734880879702,8976.61,12481.62,39.046031853895798,0,0,0]
[{"$f":"VLOOKUP(C499,Sheet3!$A$1:$C$821,2,FALSE)","v":"Middle Schools"},"Irrigation","SPILLANEMS","Cypress, TX",235889,367,596,532,-10.738255033557,4751.4399999999996,4458.16,-6.1724445641742296,0,0,0]
[{"$f":"VLOOKUP(C500,Sheet3!$A$1:$C$821,2,FALSE)","v":"Elementary Schools"},"Irrigation","SWENKEES","Cypress, TX",107914,367,1803,545,-69.772601220188605,10727.85,3460.75,-67.740507184571001,0,0,0]
[{"$f":"VLOOKUP(C501,Sheet3!$A$1:$C$821,2,FALSE)","v":"Elementary Schools"},"Irrigation","TIPPSES","Houston, TX",101727,367,0,371,0,270,2937.41,987.92962962962997,0,0,0]
[{"$f":"VLOOKUP(C502,Sheet3!$A$1:$C$821,2,FALSE)","v":"Elementary Schools"},"Irrigation","WALKERES","Katy, TX",98321,367,538,643,19.5167286245353,3275.63,4126.4799999999996,25.9751559242039,0,0,0]
[{"$f":"VLOOKUP(C503,Sheet3!$A$1:$C$821,2,FALSE)","v":"Elementary Schools"},"Irrigation","WARNERES","Cypress, TX",98451,44044,740,694,-6.2162162162162202,4103.1499999999996,4042.24,-1.48446924923534,0,0,0]
[{"$f":"VLOOKUP(C504,Sheet3!$A$1:$C$821,2,FALSE)","v":"Elementary Schools"},"Irrigation","WELLSES","Cypress, TX",136702,44409,369,1956,430.081300813008,2319.35,12667.08,446.14784314570898,0,0,0]
[{"$f":"VLOOKUP(C505,Sheet3!$A$1:$C$821,2,FALSE)","v":"Administration"},"Irrigation","WESTGREENTRANS","Cypress, TX",45340,367,99,113,14.141414141414099,632.77,657.96,3.9809093351454701,0,0,0]
[{"$f":"VLOOKUP(C506,Sheet3!$A$1:$C$821,2,FALSE)","v":"Elementary Schools"},"Irrigation","WOODARDES","Cypress, TX",116974,44044,126,15,-88.095238095238102,796.27,180.2,-77.369485224860895,0,0,0]
[{"$f":"VLOOKUP(C507,Sheet3!$A$1:$C$821,2,FALSE)","v":"Elementary Schools"},"Irrigation","YEAGERES","Houston, TX",99033,44409,117,56,-52.136752136752101,817.41,515.12,-36.981441381925798,0,0,0]
[{"$f":"VLOOKUP(C508,Sheet3!$A$1:$C$821,2,FALSE)","v":"Special Schools"},"Irrigation","ALCWEST","Katy, TX",50839,367,48,24,-50,400.8,317.89999999999998,-20.683632734530899,0,0,0]
[{"$f":"VLOOKUP(C509,Sheet3!$A$1:$C$821,2,FALSE)","v":"Elementary Schools"},"Irrigation","ANDREES","Cypress, TX",100156,43952,193,0,-100,1167.96,133.19999999999999,-88.595499845885101,0,0,0]
[{"$f":"VLOOKUP(C510,Sheet3!$A$1:$C$821,2,FALSE)","v":"Middle Schools"},"Irrigation","ANTHONYMS","Cypress, TX",244123,367,1153,478,-58.5429314830876,8570.8799999999992,3659.22,-57.306367607526902,0,0,0]
[{"$f":"VLOOKUP(C511,Sheet3!$A$1:$C$821,2,FALSE)","v":"Middle Schools"},"Irrigation","ARAGONMS","Houston, TX",219821,367,1128,637,-43.528368794326198,6859.24,4096.33,-40.280118497093,0,0,0]
[{"$f":"VLOOKUP(C512,Sheet3!$A$1:$C$821,2,FALSE)","v":"Administration"},"Irrigation","BERRYCENTER","Cypress, TX",491434,367,1840,645.35,-64.926630434782595,12680.03,4778.3999999999996,-62.3155465720507,0,0,0]
[{"$f":"VLOOKUP(C513,Sheet3!$A$1:$C$821,2,FALSE)","v":"Elementary Schools"},"Irrigation","BIRKESES","Houston, TX",104952,44044,4,9,125,93.84,122.16,30.1790281329923,0,0,0]
[{"$f":"VLOOKUP(C514,Sheet3!$A$1:$C$821,2,FALSE)","v":"Elementary Schools"},"Irrigation","BLACKES","Cypress, TX",101992,44409,193,4,-97.927461139896394,1963.87,278.98,-85.794375391446493,0,0,0]
[{"$f":"VLOOKUP(C515,Sheet3!$A$1:$C$821,2,FALSE)","v":"Administration"},"Irrigation","BRADLEYPOLICESTATION","Cypress, TX",19680,43952,1,12,1100,57.6,117.15,103.385416666667,0,0,0]
[{"$f":"VLOOKUP(C516,Sheet3!$A$1:$C$821,2,FALSE)","v":"High Schools"},"Irrigation","BRIDGELANDHS","Cypress, TX",579612,44409,3368,2342,-30.4631828978622,21121.85,15626.04,-26.019548477051,0,0,0]
[{"$f":"VLOOKUP(C517,Sheet3!$A$1:$C$821,2,FALSE)","v":"Middle Schools"},"Irrigation","COOKMS","Houston, TX",205797,43952,1037,17.2,-98.341369334619102,8272.9500000000007,165.37,-98.001075795212103,0,0,0]
[{"$f":"VLOOKUP(C518,Sheet3!$A$1:$C$821,2,FALSE)","v":"High Schools"},"Irrigation","CY-FALLSHS","Houston, TX",565245,44409,773,816,5.5627425614488999,5110.79,5952.45,16.468295508130801,0,0,0]
[{"$f":"VLOOKUP(C519,Sheet3!$A$1:$C$821,2,FALSE)","v":"High Schools"},"Irrigation","CY-LAKESHS","Katy, TX",514068,43952,1536,1932,25.78125,9228.1,10108.08,9.53587412360074,0,0,0]
[{"$f":"VLOOKUP(C520,Sheet3!$A$1:$C$821,2,FALSE)","v":"High Schools"},"Irrigation","CY-PARKHS","Cypress, TX",590057,367,4195,1939,-53.7783075089392,27509.9,13281.95,-51.719381022831797,0,0,0]
[{"$f":"VLOOKUP(C521,Sheet3!$A$1:$C$821,2,FALSE)","v":"High Schools"},"Irrigation","CY-RANCHHS","Cypress, TX",527481,44409,2153,1060,-50.766372503483502,12546.13,6603.62,-47.3652831590299,0,0,0]
[{"$f":"VLOOKUP(C522,Sheet3!$A$1:$C$821,2,FALSE)","v":"High Schools"},"Irrigation","CY-RIDGEHS","Houston, TX",502564,44044,2015,579,-71.265508684863505,9787.75,2985.4,-69.4986079538198,0,0,0]
[{"$f":"VLOOKUP(C523,Sheet3!$A$1:$C$821,2,FALSE)","v":"High Schools"},"Irrigation","CY-SPRINGSHS","Cypress, TX",478615,44044,1200,929,-22.5833333333333,8232,6614.48,-19.649173955296401,0,0,0]
[{"$f":"VLOOKUP(C524,Sheet3!$A$1:$C$821,2,FALSE)","v":"High Schools"},"Irrigation","CY-WOODSHS","Cypress, TX",501359,44409,2259,1777,-21.336874723328901,18398.16,15492.76,-15.791796570961401,0,0,0]
[{"$f":"VLOOKUP(C525,Sheet3!$A$1:$C$821,2,FALSE)","v":"Elementary Schools"},"Irrigation","DANISHES","Houston, TX",98052,43952,273,108.18,-60.373626373626401,1833.44,663.78,-63.795924600750503,0,0,0]
[{"$f":"VLOOKUP(C526,Sheet3!$A$1:$C$821,2,FALSE)","v":"Middle Schools"},"Irrigation","DEANMS","Houston, TX",222788,44044,254,2006,689.763779527559,3031.76,3779.08,24.649708420191601,0,0,0]
[{"$f":"VLOOKUP(C527,Sheet3!$A$1:$C$821,2,FALSE)","v":"Elementary Schools"},"Irrigation","DURYEAES","Katy, TX",96423,43952,567,22,-96.119929453262799,3889.62,156.63999999999999,-95.972871385893697,0,0,0]
[{"$f":"VLOOKUP(C528,Sheet3!$A$1:$C$821,2,FALSE)","v":"Administration"},"Irrigation","ELDRIDGETRANS","Houston, TX",26451,44409,101,623,516.831683168317,657.35,3307.3,403.12618848406498,0,0,0]
[{"$f":"VLOOKUP(C529,Sheet3!$A$1:$C$821,2,FALSE)","v":"Elementary Schools"},"Irrigation","EMERYES","Katy, TX",98438,44044,0,108,0,330,965.96,192.715151515152,0,0,0]
[{"$f":"VLOOKUP(C530,Sheet3!$A$1:$C$821,2,FALSE)","v":"Elementary Schools"},"Irrigation","FARNEYES","Cypress, TX",95036,367,94,688,631.91489361702099,797.66,6047.9,658.20525035729497,0,0,0]
[{"$f":"VLOOKUP(C531,Sheet3!$A$1:$C$821,2,FALSE)","v":"Elementary Schools"},"Irrigation","GLEASONES","Houston, TX",91424,367,0.307,7.4850000000000003,2338.1107491856701,91.27,124.66,36.583762463021799,0,0,0]
[{"$f":"VLOOKUP(C532,Sheet3!$A$1:$C$821,2,FALSE)","v":"Middle Schools"},"Irrigation","GOODSONMS","Cypress, TX",218801,367,1328,271,-79.593373493975903,10837.52,2387.2600000000002,-77.972266717846907,0,0,0]
[{"$f":"VLOOKUP(C533,Sheet3!$A$1:$C$821,2,FALSE)","v":"Middle Schools"},"Irrigation","HAMILTONMS","Cypress, TX",194726,44044,1224,76,-93.790849673202601,9376.74,532.66999999999996,-94.319241015534203,0,0,0]
[{"$f":"VLOOKUP(C534,Sheet3!$A$1:$C$821,2,FALSE)","v":"Elementary Schools"},"Irrigation","HEMMENWAYES","Katy, TX",101091,44044,446,53,-88.116591928251097,2841.92,365.65,-87.133698344780996,0,0,0]
[{"$f":"VLOOKUP(C535,Sheet3!$A$1:$C$821,2,FALSE)","v":"Elementary Schools"},"Irrigation","HOOVERES","Katy, TX",112519,367,1043,208,-80.057526366251196,8066.3,1636.8,-79.708168553116096,0,0,0]
[{"$f":"VLOOKUP(C536,Sheet3!$A$1:$C$821,2,FALSE)","v":"Middle Schools"},"Irrigation","HOPPERMS","Cypress, TX",226178,367,1609,869,-45.991298943443098,11037.74,6187.28,-43.9443219354687,0,0,0]
[{"$f":"VLOOKUP(C537,Sheet3!$A$1:$C$821,2,FALSE)","v":"Administration"},"Irrigation","ISCW","Houston, TX",35364,367,31.6,173.5,449.05063291139197,305.95,1369.63,347.66465108677897,0,0,0]
[{"$f":"VLOOKUP(C538,Sheet3!$A$1:$C$821,2,FALSE)","v":"Administration"},"Irrigation","JERSEYVILLAGESTADIUM","Houston, TX",2385,367,1076,741,-31.133828996282499,7906.2,6371,-19.417672206622701,0,0,0]
[{"$f":"VLOOKUP(C539,Sheet3!$A$1:$C$821,2,FALSE)","v":"Elementary Schools"},"Irrigation","JOWELLES","Katy, TX",73726,367,689,61,-91.146589259796798,4959.8999999999996,545.35,-89.004818645537199,0,0,0]
[{"$f":"VLOOKUP(C540,Sheet3!$A$1:$C$821,2,FALSE)","v":"Middle Schools"},"Irrigation","KAHLAMS","Houston, TX",221601,367,887,783,-11.724915445321299,6648.12,5695.82,-14.3243503426533,0,0,0]
[{"$f":"VLOOKUP(C541,Sheet3!$A$1:$C$821,2,FALSE)","v":"Elementary Schools"},"Irrigation","KEITHES","Cypress, TX",95518,367,373,91,-75.603217158176903,2219.35,689.4,-68.936850879762105,0,0,0]
[{"$f":"VLOOKUP(C542,Sheet3!$A$1:$C$821,2,FALSE)","v":"Elementary Schools"},"Irrigation","KIRKES","Houston, TX",93897,367,91,18,-80.219780219780205,526.20000000000005,181.9,-65.431394906879504,0,0,0]
[{"$f":"VLOOKUP(C543,Sheet3!$A$1:$C$821,2,FALSE)","v":"High Schools"},"Irrigation","LANGHAMCREEKHS","Houston, TX",536036,44409,2079,1529,-26.455026455026498,16163.62,13406,-17.060658441611501,0,0,0]
[{"$f":"VLOOKUP(C544,Sheet3!$A$1:$C$821,2,FALSE)","v":"Elementary Schools"},"Irrigation","LEEES","Houston, TX",95352,367,1669,3,-99.820251647693198,10516.32,154.04,-98.535229053509198,0,0,0]
[{"$f":"VLOOKUP(C545,Sheet3!$A$1:$C$821,2,FALSE)","v":"Elementary Schools"},"Irrigation","LOWERYES","Houston, TX",92034,44409,142,7,-95.070422535211307,672.2,58.95,-91.230288604582,0,0,0]
[{"$f":"VLOOKUP(C546,Sheet3!$A$1:$C$821,2,FALSE)","v":"Elementary Schools"},"Irrigation","MATZKEMILLSES","Houston, TX",127754,44440,388,206,-46.9072164948454,2406.56,1450.12,-39.743035702413401,0,0,0]
[{"$f":"VLOOKUP(C547,Sheet3!$A$1:$C$821,2,FALSE)","v":"Elementary Schools"},"Irrigation","MCFEEES","Katy, TX",105539,367,398,212,-46.733668341708501,2942.28,1889.82,-35.770219013826001,0,0,0]
[{"$f":"VLOOKUP(C548,Sheet3!$A$1:$C$821,2,FALSE)","v":"Elementary Schools"},"Irrigation","POPEES","Cypress, TX",112970,367,1252,55,-95.607028753993603,8120.36,397.64,-95.103172765739501,0,0,0]
[{"$f":"VLOOKUP(C549,Sheet3!$A$1:$C$821,2,FALSE)","v":"Elementary Schools"},"Irrigation","POSTMAES","Cypress, TX",98920,367,65,0,-100,409.65,78,-80.959355547418497,0,0,0]
[{"$f":"VLOOKUP(C550,Sheet3!$A$1:$C$821,2,FALSE)","v":"Elementary Schools"},"Irrigation","RENNELLES","Cypress, TX",118229,44409,29,563,1841.3793103448299,264.83999999999997,4401.12,1561.8033529678301,0,0,0]
[{"$f":"VLOOKUP(C551,Sheet3!$A$1:$C$821,2,FALSE)","v":"Elementary Schools"},"Irrigation","ROBINSONES","Katy, TX",101604,44409,389,107,-72.493573264781503,2353.2800000000002,779.2,-66.888768017405496,0,0,0]
[{"$f":"VLOOKUP(C552,Sheet3!$A$1:$C$821,2,FALSE)","v":"Elementary Schools"},"Irrigation","ROBISONES","Cypress, TX",93882,43952,9,3,-66.6666666666667,190.06,164.04,-13.690413553614601,0,0,0]
[{"$f":"VLOOKUP(C553,Sheet3!$A$1:$C$821,2,FALSE)","v":"Middle Schools"},"Irrigation","SALYARDSMS","Cypress, TX",247012,44409,2155,528,-75.498839907192604,12822.25,3509.6,-72.628828793698503,0,0,0]
[{"$f":"VLOOKUP(C554,Sheet3!$A$1:$C$821,2,FALSE)","v":"Elementary Schools"},"Irrigation","SAMPSONES","Cypress, TX",96096,367,72,34,-52.7777777777778,355.6,188.65,-46.9488188976378,0,0,0]
[{"$f":"VLOOKUP(C555,Sheet3!$A$1:$C$821,2,FALSE)","v":"Administration"},"Irrigation","SATELLITECOLDFOODWAREHOUSE","Cypress, TX",22020,367,88,72,-18.181818181818201,713.32,673.92,-5.5234677283687503,0,0,0]
[{"$f":"VLOOKUP(C556,Sheet3!$A$1:$C$821,2,FALSE)","v":"Middle Schools"},"Irrigation","SMITHMS","Cypress, TX",234695,44409,1760,645,-63.352272727272698,10129.1,3943.33,-61.069295396432103,0,0,0]
[{"$f":"VLOOKUP(C557,Sheet3!$A$1:$C$821,2,FALSE)","v":"Middle Schools"},"Irrigation","SPILLANEMS","Cypress, TX",235889,367,344,375,9.0116279069767398,2681.36,3326.96,24.077333890264601,0,0,0]
[{"$f":"VLOOKUP(C558,Sheet3!$A$1:$C$821,2,FALSE)","v":"Elementary Schools"},"Irrigation","SWENKEES","Cypress, TX",107914,367,56,18,-67.857142857142804,333.2,124.5,-62.635054021608603,0,0,0]
[{"$f":"VLOOKUP(C559,Sheet3!$A$1:$C$821,2,FALSE)","v":"Elementary Schools"},"Irrigation","TIPPSES","Houston, TX",101727,367,97,343,253.60824742267999,826.12,2571.27,211.24655013799401,0,0,0]
[{"$f":"VLOOKUP(C560,Sheet3!$A$1:$C$821,2,FALSE)","v":"Elementary Schools"},"Irrigation","WALKERES","Katy, TX",98321,367,211,370,75.355450236966803,1293.72,2417.5,86.864236465386597,0,0,0]
[{"$f":"VLOOKUP(C561,Sheet3!$A$1:$C$821,2,FALSE)","v":"Elementary Schools"},"Irrigation","WARNERES","Cypress, TX",98451,44044,700,115,-83.571428571428598,4078.25,769.54,-81.130632011279303,0,0,0]
[{"$f":"VLOOKUP(C562,Sheet3!$A$1:$C$821,2,FALSE)","v":"Elementary Schools"},"Irrigation","WELLSES","Cypress, TX",136702,44409,88,1167,1226.1363636363601,683.34,7853.04,1049.21415400825,0,0,0]
[{"$f":"VLOOKUP(C563,Sheet3!$A$1:$C$821,2,FALSE)","v":"Administration"},"Irrigation","WESTGREENTRANS","Cypress, TX",45340,367,140,19,-86.428571428571402,820.3,202.7,-75.289528221382398,0,0,0]
[{"$f":"VLOOKUP(C564,Sheet3!$A$1:$C$821,2,FALSE)","v":"Elementary Schools"},"Irrigation","WOODARDES","Cypress, TX",116974,44044,70,0,-100,491.1,120,-75.565058032987196,0,0,0]
[{"$f":"VLOOKUP(C565,Sheet3!$A$1:$C$821,2,FALSE)","v":"Elementary Schools"},"Irrigation","YEAGERES","Houston, TX",99033,44409,138,0,-100,934.44,180,-80.737125979196094,0,0,0]
[{"$f":"VLOOKUP(C566,Sheet3!$A$1:$C$821,2,FALSE)","v":"Elementary Schools"},"Nat_Gas","ADAM-ES","Houston, TX",103177,367,248,300,20.9677419354839,1039.98,1212.58,16.5964730090963,0,0,0]
[{"$f":"VLOOKUP(C567,Sheet3!$A$1:$C$821,2,FALSE)","v":"Special Schools"},"Nat_Gas","ALCABC","Houston, TX",56061,367,219,134,-38.812785388127899,948.31,683.19,-27.957102635214198,0,0,0]
[{"$f":"VLOOKUP(C568,Sheet3!$A$1:$C$821,2,FALSE)","v":"Special Schools"},"Nat_Gas","ALCWEST","Katy, TX",50839,367,448,426,-4.91071428571429,1841.09,1719.26,-6.6172756356288902,0,0,0]
[{"$f":"VLOOKUP(C569,Sheet3!$A$1:$C$821,2,FALSE)","v":"Elementary Schools"},"Nat_Gas","ANDREES","Cypress, TX",100156,43952,237,453,91.139240506329102,1007.15,1676.87,66.496549669860499,0,0,0]
[{"$f":"VLOOKUP(C570,Sheet3!$A$1:$C$821,2,FALSE)","v":"Middle Schools"},"Nat_Gas","ANTHONYMS","Cypress, TX",244123,367,847,783,-7.5560802833530101,3346.34,3518.07,5.1318754221029499,0,0,0]
[{"$f":"VLOOKUP(C571,Sheet3!$A$1:$C$821,2,FALSE)","v":"Middle Schools"},"Nat_Gas","ARAGONMS","Houston, TX",219821,367,695,832,19.712230215827301,2880.36,3417.48,18.647669041369799,0,0,0]
[{"$f":"VLOOKUP(C572,Sheet3!$A$1:$C$821,2,FALSE)","v":"Middle Schools"},"Nat_Gas","ARNOLDMS","Cypress, TX",210699,44409,3652,5888,61.2267250821468,13999.03,20903.02,49.3176312930253,0,0,0]
[{"$f":"VLOOKUP(C573,Sheet3!$A$1:$C$821,2,FALSE)","v":"Elementary Schools"},"Nat_Gas","AULTES","Cypress, TX",91912,43952,152,191,25.657894736842099,727.45,868.93,19.448759364904799,0,0,0]
[{"$f":"VLOOKUP(C574,Sheet3!$A$1:$C$821,2,FALSE)","v":"Elementary Schools"},"Nat_Gas","BANEES","Houston, TX",106804,367,346,394,13.8728323699422,1382.97,1531.9,10.768852541993001,0,0,0]
[{"$f":"VLOOKUP(C575,Sheet3!$A$1:$C$821,2,FALSE)","v":"Elementary Schools"},"Nat_Gas","BANGES","Houston, TX",89313,44044,251,338,34.661354581673301,1060.01,1328.4,25.3195724568636,0,0,0]
[{"$f":"VLOOKUP(C576,Sheet3!$A$1:$C$821,2,FALSE)","v":"Administration"},"Nat_Gas","BARKERTRANS","Houston, TX",22677,367,55,49,-10.909090909090899,321.32,302.02999999999997,-6.0033611353168199,0,0,0]
[{"$f":"VLOOKUP(C577,Sheet3!$A$1:$C$821,2,FALSE)","v":"Administration"},"Nat_Gas","BERRYCENTER","Cypress, TX",491434,367,1188,1651,38.973063973064001,5683.16,7237.3,27.346405872789099,0,0,0]
[{"$f":"VLOOKUP(C578,Sheet3!$A$1:$C$821,2,FALSE)","v":"Elementary Schools"},"Nat_Gas","BIRKESES","Houston, TX",104952,44044,222,503,126.576576576577,1057.19,2030.72,92.086569112458506,0,0,0]
[{"$f":"VLOOKUP(C579,Sheet3!$A$1:$C$821,2,FALSE)","v":"Elementary Schools"},"Nat_Gas","BLACKES","Cypress, TX",101992,44409,161,194,20.496894409937902,763.76,883.2,15.6384204462135,0,0,0]
[{"$f":"VLOOKUP(C580,Sheet3!$A$1:$C$821,2,FALSE)","v":"Middle Schools"},"Nat_Gas","BLEYLMS","Houston, TX",234294,44409,1374,1710,24.454148471615699,5410.54,6621.48,22.381130164456799,0,0,0]
[{"$f":"VLOOKUP(C581,Sheet3!$A$1:$C$821,2,FALSE)","v":"Administration"},"Nat_Gas","BRADLEYPOLICESTATION","Cypress, TX",19680,43952,89,70,-21.348314606741599,430.84,370.27,-14.0585832327546,0,0,0]
["Special Schools","Nat_Gas","BRAUTIGAMCENTER","Houston, TX",79751,44409,457,471,3.06345733041575,1740.93,1749.51,0.49284003377505098,0,0,0]
[{"$f":"VLOOKUP(C583,Sheet3!$A$1:$C$821,2,FALSE)","v":"High Schools"},"Nat_Gas","BRIDGELANDHS","Cypress, TX",579612,44409,339,485,43.067846607669601,1975.26,3349.14,69.554387776799004,0,0,0]
[{"$f":"VLOOKUP(C584,Sheet3!$A$1:$C$821,2,FALSE)","v":"Middle Schools"},"Nat_Gas","CAMPBELLMS","Houston, TX",232217,44409,1005,1011,0.59701492537313405,4082.96,4151.6099999999997,1.6813782158042201,0,0,0]
[{"$f":"VLOOKUP(C585,Sheet3!$A$1:$C$821,2,FALSE)","v":"Administration"},"Nat_Gas","CFISDNATATORIUM","Houston, TX",49471,367,9826,5205,-47.028292285772402,32854.78,19977.59,-39.194266405070998,0,0,0]
[{"$f":"VLOOKUP(C586,Sheet3!$A$1:$C$821,2,FALSE)","v":"Middle Schools"},"Nat_Gas","COOKMS","Houston, TX",205797,43952,767,1286,67.666232073011699,3034.73,4714.99,55.367693336804301,0,0,0]
[{"$f":"VLOOKUP(C587,Sheet3!$A$1:$C$821,2,FALSE)","v":"Elementary Schools"},"Nat_Gas","COPELANDES","Houston, TX",91324,44409,117,252,115.384615384615,611.25,1183.06,93.547648261758695,0,0,0]
[{"$f":"VLOOKUP(C588,Sheet3!$A$1:$C$821,2,FALSE)","v":"High Schools"},"Nat_Gas","CY-CREEKHS","Houston, TX",528099,44409,3922,3518,-10.3008669046405,14034.77,12812.55,-8.7085146390001391,0,0,0]
[{"$f":"VLOOKUP(C589,Sheet3!$A$1:$C$821,2,FALSE)","v":"High Schools"},"Nat_Gas","CY-FALLSAGVOC","Houston, TX",0,367,87,79,-9.1954022988505706,516.13,498.44,-3.4274310735667401,0,0,0]
[{"$f":"VLOOKUP(C590,Sheet3!$A$1:$C$821,2,FALSE)","v":"High Schools"},"Nat_Gas","CY-FALLSHS","Houston, TX",565245,44409,1562,2202,40.973111395646598,5999.29,7916.03,31.9494473512699,0,0,0]
[{"$f":"VLOOKUP(C591,Sheet3!$A$1:$C$821,2,FALSE)","v":"High Schools"},"Nat_Gas","CY-LAKESHS","Katy, TX",514068,43952,2548,2327,-8.6734693877550999,9830.86,9306.7000000000007,-5.3317817566316696,0,0,0]
[{"$f":"VLOOKUP(C592,Sheet3!$A$1:$C$821,2,FALSE)","v":"High Schools"},"Nat_Gas","CY-PARKHS","Cypress, TX",590057,367,4070,6662,63.685503685503697,14415.09,23303.95,61.663576155265098,0,0,0]
[{"$f":"VLOOKUP(C593,Sheet3!$A$1:$C$821,2,FALSE)","v":"High Schools"},"Nat_Gas","CY-RANCHHS","Cypress, TX",527481,44409,1870,2686,43.636363636363598,7546.74,10146.620000000001,34.450371948682502,0,0,0]
[{"$f":"VLOOKUP(C594,Sheet3!$A$1:$C$821,2,FALSE)","v":"High Schools"},"Nat_Gas","CY-RIDGEHS","Houston, TX",502564,44044,1988,3201,61.016096579476901,7831.67,11825.85,51.000361353325701,0,0,0]
[{"$f":"VLOOKUP(C595,Sheet3!$A$1:$C$821,2,FALSE)","v":"High Schools"},"Nat_Gas","CY-SPRINGSHS","Cypress, TX",478615,44044,2413,2174,-9.9046829672606709,9094.2999999999993,8195.09,-9.8876219170249495,0,0,0]
[{"$f":"VLOOKUP(C596,Sheet3!$A$1:$C$821,2,FALSE)","v":"Special Schools"},"Nat_Gas","CY-WOODSCARLTONCENTERKITCHEN","Cypress, TX",37977,367,12,11,-8.3333333333333304,265.3,264.3,-0.37693177534866201,0,0,0]
[{"$f":"VLOOKUP(C597,Sheet3!$A$1:$C$821,2,FALSE)","v":"High Schools"},"Nat_Gas","CY-WOODSHS","Cypress, TX",501359,44409,2740,3626,32.335766423357697,10393.120000000001,13021.69,25.291442800621901,0,0,0]
[{"$f":"VLOOKUP(C598,Sheet3!$A$1:$C$821,2,FALSE)","v":"Elementary Schools"},"Nat_Gas","DANISHES","Houston, TX",98052,43952,216,214,-0.92592592592592604,948.21,944.52,-0.38915430126237899,0,0,0]
[{"$f":"VLOOKUP(C599,Sheet3!$A$1:$C$821,2,FALSE)","v":"Middle Schools"},"Nat_Gas","DEANMS","Houston, TX",222788,44044,467,772,65.310492505353295,2361.79,3414.18,44.558999741721301,0,0,0]
[{"$f":"VLOOKUP(C600,Sheet3!$A$1:$C$821,2,FALSE)","v":"Elementary Schools"},"Nat_Gas","DURYEAES","Katy, TX",96423,43952,194,229,18.041237113402101,862.14,992.07,15.070638179414001,0,0,0]
[{"$f":"VLOOKUP(C601,Sheet3!$A$1:$C$821,2,FALSE)","v":"Administration"},"Nat_Gas","ELC1","Houston, TX",6832,367,2,3,50,143.16,147.13,2.77312098351495,0,0,0]
[{"$f":"VLOOKUP(C602,Sheet3!$A$1:$C$821,2,FALSE)","v":"Administration"},"Nat_Gas","ELDRIDGETRANS","Houston, TX",26451,44409,90,109,21.1111111111111,521.77,597.26,14.4680606397455,0,0,0]
[{"$f":"VLOOKUP(C603,Sheet3!$A$1:$C$821,2,FALSE)","v":"Elementary Schools"},"Nat_Gas","EMERYES","Katy, TX",98438,44044,128,141,10.15625,649.75,691.52,6.4286263947672202,0,0,0]
[{"$f":"VLOOKUP(C604,Sheet3!$A$1:$C$821,2,FALSE)","v":"Elementary Schools"},"Nat_Gas","EMMOTTES","Houston, TX",77394,43952,113,125,10.6194690265487,593.04999999999995,642.45000000000005,8.3298204198634203,0,0,0]
[{"$f":"VLOOKUP(C605,Sheet3!$A$1:$C$821,2,FALSE)","v":"Administration"},"Nat_Gas","EXHIBITCENTERSCIENCERESOURCEC","Cypress, TX",72198,367,528,442,-16.2878787878788,2049.44,1734.35,-15.374443750487901,0,0,0]
[{"$f":"VLOOKUP(C606,Sheet3!$A$1:$C$821,2,FALSE)","v":"Administration"},"Nat_Gas","FALCONCOMPLEX","Houston, TX",0,367,160,210,31.25,762.25,933.19,22.425713348638901,0,0,0]
[{"$f":"VLOOKUP(C607,Sheet3!$A$1:$C$821,2,FALSE)","v":"Elementary Schools"},"Nat_Gas","FARNEYES","Cypress, TX",95036,367,302,645,113.57615894039699,1417.29,3172.12,123.815873956636,0,0,0]
[{"$f":"VLOOKUP(C608,Sheet3!$A$1:$C$821,2,FALSE)","v":"Elementary Schools"},"Nat_Gas","FIESTES","Houston, TX",96117,44409,140,145,3.5714285714285698,680.4,704.71,3.5728982951205199,0,0,0]
[{"$f":"VLOOKUP(C609,Sheet3!$A$1:$C$821,2,FALSE)","v":"Administration"},"Nat_Gas","FOODPRODUCTIONCENTER","Houston, TX",57684,367,6360,8012,25.974842767295598,24024.44,28785.49,19.817527484511601,0,0,0]
[{"$f":"VLOOKUP(C610,Sheet3!$A$1:$C$821,2,FALSE)","v":"Administration"},"Nat_Gas","FOODSERVICEWAREHOUSE","Houston, TX",48487,43952,302,262,-13.245033112582799,1149.22,1034.05,-10.021579854162001,0,0,0]
[{"$f":"VLOOKUP(C611,Sheet3!$A$1:$C$821,2,FALSE)","v":"Elementary Schools"},"Nat_Gas","FRANCONEES","Houston, TX",88982,44409,193,219,13.4715025906736,863.58,937.66,8.5782440538224591,0,0,0]
[{"$f":"VLOOKUP(C612,Sheet3!$A$1:$C$821,2,FALSE)","v":"Elementary Schools"},"Nat_Gas","GLEASONES","Houston, TX",91424,367,418,380,-9.0909090909090899,1615.23,1535.41,-4.9417110875850501,0,0,0]
[{"$f":"VLOOKUP(C613,Sheet3!$A$1:$C$821,2,FALSE)","v":"Middle Schools"},"Nat_Gas","GOODSONMS","Cypress, TX",218801,367,1094,1405,28.427787934186501,3910.01,5106.37,30.597364201114601,0,0,0]
[{"$f":"VLOOKUP(C614,Sheet3!$A$1:$C$821,2,FALSE)","v":"Elementary Schools"},"Nat_Gas","HAIRGROVEES","Houston, TX",90830,44409,150,182,21.3333333333333,720.19,841.02,16.777517044113399,0,0,0]
[{"$f":"VLOOKUP(C615,Sheet3!$A$1:$C$821,2,FALSE)","v":"Elementary Schools"},"Nat_Gas","HAMILTONES","Cypress, TX",89692,44044,142,148,4.2253521126760596,698.94,725.13,3.7471027556013401,0,0,0]
[{"$f":"VLOOKUP(C616,Sheet3!$A$1:$C$821,2,FALSE)","v":"Middle Schools"},"Nat_Gas","HAMILTONMS","Cypress, TX",194726,44044,646,1254,94.117647058823493,2562.81,4601.7,79.556814590234893,0,0,0]
[{"$f":"VLOOKUP(C617,Sheet3!$A$1:$C$821,2,FALSE)","v":"Elementary Schools"},"Nat_Gas","HANCOCKES","Houston, TX",87259,44409,369,455,23.306233062330602,1432.75,1795.52,25.319839469551599,0,0,0]
[{"$f":"VLOOKUP(C618,Sheet3!$A$1:$C$821,2,FALSE)","v":"Elementary Schools"},"Nat_Gas","HEMMENWAYES","Katy, TX",101091,44044,199,389,95.477386934673405,879.03,1464.93,66.653015255452004,0,0,0]
[{"$f":"VLOOKUP(C619,Sheet3!$A$1:$C$821,2,FALSE)","v":"Elementary Schools"},"Nat_Gas","HOLBROOKES","Houston, TX",99937,367,219,394,79.908675799086794,1066.96,1621.9,52.011321886481198,0,0,0]
[{"$f":"VLOOKUP(C620,Sheet3!$A$1:$C$821,2,FALSE)","v":"Elementary Schools"},"Nat_Gas","HOLMSLEYES","Houston, TX",81704,44044,334,389,16.4670658682635,1313.92,1449.54,10.3217851924014,0,0,0]
[{"$f":"VLOOKUP(C621,Sheet3!$A$1:$C$821,2,FALSE)","v":"Elementary Schools"},"Nat_Gas","HOOVERES","Katy, TX",112519,367,225,703,212.444444444444,966.82,2649.9,174.08411079621899,0,0,0]
[{"$f":"VLOOKUP(C622,Sheet3!$A$1:$C$821,2,FALSE)","v":"Middle Schools"},"Nat_Gas","HOPPERMS","Cypress, TX",226178,367,854,1712,100.468384074941,3511.18,6371.75,81.4703319112093,0,0,0]
[{"$f":"VLOOKUP(C623,Sheet3!$A$1:$C$821,2,FALSE)","v":"Elementary Schools"},"Nat_Gas","HORNEES","Houston, TX",95855,44409,195,257,31.794871794871799,869.5,1096.02,26.051753881541099,0,0,0]
[{"$f":"VLOOKUP(C624,Sheet3!$A$1:$C$821,2,FALSE)","v":"Administration"},"Nat_Gas","ISCA","Houston, TX",132467,367,277,287,3.6101083032490999,1230.73,1277.24,3.7790579574723902,0,0,0]
[{"$f":"VLOOKUP(C625,Sheet3!$A$1:$C$821,2,FALSE)","v":"Administration"},"Nat_Gas","ISCW","Houston, TX",35364,367,116,62,-46.551724137930997,613.01,800.43,30.573726366617201,0,0,0]
[{"$f":"VLOOKUP(C626,Sheet3!$A$1:$C$821,2,FALSE)","v":"High Schools"},"Nat_Gas","JERSEYVILLAGEHS","Houston, TX",513823,44409,1176,2062,75.340136054421805,4373.1099999999997,7599.65,73.781359261486699,0,0,0]
[{"$f":"VLOOKUP(C627,Sheet3!$A$1:$C$821,2,FALSE)","v":"Elementary Schools"},"Nat_Gas","JOWELLES","Katy, TX",73726,367,107,179,67.289719626168207,583.09,817.49,40.199626129757,0,0,0]
[{"$f":"VLOOKUP(C628,Sheet3!$A$1:$C$821,2,FALSE)","v":"Middle Schools"},"Nat_Gas","KAHLAMS","Houston, TX",221601,367,1138,1463,28.558875219683699,4606.8900000000003,5783.85,25.547820764116398,0,0,0]
[{"$f":"VLOOKUP(C629,Sheet3!$A$1:$C$821,2,FALSE)","v":"Elementary Schools"},"Nat_Gas","KEITHES","Cypress, TX",95518,367,194,260,34.020618556701002,960.93,1205,25.3993527103951,0,0,0]
[{"$f":"VLOOKUP(C630,Sheet3!$A$1:$C$821,2,FALSE)","v":"Elementary Schools"},"Nat_Gas","KIRKES","Houston, TX",93897,367,289,304,5.1903114186851198,1279.8800000000001,1353.49,5.7513204362909001,0,0,0]
[{"$f":"VLOOKUP(C631,Sheet3!$A$1:$C$821,2,FALSE)","v":"Middle Schools"},"Nat_Gas","LABAYMS","Houston, TX",190510,43952,839,931,10.965435041716299,3144.37,3539.28,12.5592726046871,0,0,0]
[{"$f":"VLOOKUP(C632,Sheet3!$A$1:$C$821,2,FALSE)","v":"Elementary Schools"},"Nat_Gas","LAMKINES","Cypress, TX",113622,43956,232,269,15.948275862069,986.33,1117.83,13.332251883243901,0,0,0]
[{"$f":"VLOOKUP(C633,Sheet3!$A$1:$C$821,2,FALSE)","v":"High Schools"},"Nat_Gas","LANGHAMCREEKHS","Houston, TX",536036,44409,2006,1886,-5.9820538384845499,6767.81,7007.1,3.5357080059871699,0,0,0]
[{"$f":"VLOOKUP(C634,Sheet3!$A$1:$C$821,2,FALSE)","v":"Administration"},"Nat_Gas","LANGHAMCREEKRETENTIONPOND","Houston, TX",0,367,17,10,-41.176470588235297,190.12,165.74,-12.823479907426901,0,0,0]
[{"$f":"VLOOKUP(C635,Sheet3!$A$1:$C$821,2,FALSE)","v":"Elementary Schools"},"Nat_Gas","LEEES","Houston, TX",95352,367,365,877,140.27397260274,1519.08,3171.66,108.788213918951,0,0,0]
[{"$f":"VLOOKUP(C636,Sheet3!$A$1:$C$821,2,FALSE)","v":"Elementary Schools"},"Nat_Gas","LIEDERES","Houston, TX",83798,44440,309,271,-12.2977346278317,1347.44,1221.25,-9.3651665380276707,0,0,0]
[{"$f":"VLOOKUP(C637,Sheet3!$A$1:$C$821,2,FALSE)","v":"Elementary Schools"},"Nat_Gas","LOWERYES","Houston, TX",92034,44409,0,62,0,136.56,343.39,151.45723491505601,0,0,0]
[{"$f":"VLOOKUP(C638,Sheet3!$A$1:$C$821,2,FALSE)","v":"Administration"},"Nat_Gas","MAINTENANCEOPER","Houston, TX",36679,43952,100,353,253,562.75,1372.32,143.85961794757901,0,0,0]
[{"$f":"VLOOKUP(C639,Sheet3!$A$1:$C$821,2,FALSE)","v":"Elementary Schools"},"Nat_Gas","MATZKEMILLSES","Houston, TX",127754,44440,375,467,24.533333333333299,1551.17,2076.4,33.860247426136397,0,0,0]
[{"$f":"VLOOKUP(C640,Sheet3!$A$1:$C$821,2,FALSE)","v":"Elementary Schools"},"Nat_Gas","MCFEEES","Katy, TX",105539,367,359,241,-32.869080779944298,1490.12,1120.43,-24.809411322578001,0,0,0]
[{"$f":"VLOOKUP(C641,Sheet3!$A$1:$C$821,2,FALSE)","v":"Elementary Schools"},"Nat_Gas","METCALFES","Houston, TX",85120,43956,143,210,46.853146853146903,702.17,935.65,33.251206972670403,0,0,0]
[{"$f":"VLOOKUP(C642,Sheet3!$A$1:$C$821,2,FALSE)","v":"Elementary Schools"},"Nat_Gas","MILLSAPES","Cypress, TX",94477,44409,203,119,-41.379310344827601,897.27,628.67999999999995,-29.934133538399799,0,0,0]
[{"$f":"VLOOKUP(C643,Sheet3!$A$1:$C$821,2,FALSE)","v":"Elementary Schools"},"Nat_Gas","MOOREES","Houston, TX",83063,43952,214,249,16.3551401869159,927.21,1059.3399999999999,14.250277714865,0,0,0]
[{"$f":"VLOOKUP(C644,Sheet3!$A$1:$C$821,2,FALSE)","v":"Elementary Schools"},"Nat_Gas","OWENSES","Houston, TX",87177,44409,279,329,17.921146953405,1133.55,1274.57,12.4405628335759,0,0,0]
[{"$f":"VLOOKUP(C645,Sheet3!$A$1:$C$821,2,FALSE)","v":"Elementary Schools"},"Nat_Gas","POPEES","Cypress, TX",112970,367,225,278,23.5555555555556,978.72,1153.83,17.891736145169201,0,0,0]
[{"$f":"VLOOKUP(C646,Sheet3!$A$1:$C$821,2,FALSE)","v":"Elementary Schools"},"Nat_Gas","POSTES","Houston, TX",104852,367,395,602,52.4050632911392,1657.26,2346.9,41.613265269179202,0,0,0]
[{"$f":"VLOOKUP(C647,Sheet3!$A$1:$C$821,2,FALSE)","v":"Elementary Schools"},"Nat_Gas","POSTMAES","Cypress, TX",98920,367,215,286,33.023255813953497,944.42,1200.0999999999999,27.072700705194698,0,0,0]
[{"$f":"VLOOKUP(C648,Sheet3!$A$1:$C$821,2,FALSE)","v":"Administration"},"Nat_Gas","PRIDGEONSTADIUM","Houston, TX",86181,367,25,47,88,222,290.7,30.945945945945901,0,0,0]
[{"$f":"VLOOKUP(C649,Sheet3!$A$1:$C$821,2,FALSE)","v":"Elementary Schools"},"Nat_Gas","REEDES","Houston, TX",90012,367,105,150,42.857142857142897,578.76,740.26,27.904485451655301,0,0,0]
[{"$f":"VLOOKUP(C650,Sheet3!$A$1:$C$821,2,FALSE)","v":"Elementary Schools"},"Nat_Gas","RENNELLES","Cypress, TX",118229,44409,232,152,-34.482758620689701,994.43,741.81,-25.403497480969001,0,0,0]
[{"$f":"VLOOKUP(C651,Sheet3!$A$1:$C$821,2,FALSE)","v":"Elementary Schools"},"Nat_Gas","ROBINSONES","Katy, TX",101604,44409,109,124,13.7614678899083,587.61,647.75,10.234679464270499,0,0,0]
[{"$f":"VLOOKUP(C652,Sheet3!$A$1:$C$821,2,FALSE)","v":"Elementary Schools"},"Nat_Gas","ROBISONES","Cypress, TX",93882,43952,160,312,95,755.81,1275.25,68.7262671835514,0,0,0]
[{"$f":"VLOOKUP(C653,Sheet3!$A$1:$C$821,2,FALSE)","v":{"$error":"#N/A"}},"Nat_Gas","ROWEMS","Cypress, TX",271966,367,0,193,0,0,1134.8699999999999,0,0,null,0]
[{"$f":"VLOOKUP(C654,Sheet3!$A$1:$C$821,2,FALSE)","v":"Middle Schools"},"Nat_Gas","SALYARDSMS","Cypress, TX",242116,43952,375,443,18.133333333333301,1649.23,1889.92,14.5940832994792,0,0,0]
[{"$f":"VLOOKUP(C655,Sheet3!$A$1:$C$821,2,FALSE)","v":"Elementary Schools"},"Nat_Gas","SAMPSONES","Cypress, TX",96096,367,166,271,63.253012048192801,779.49,1152.3399999999999,47.832557184826001,0,0,0]
[{"$f":"VLOOKUP(C656,Sheet3!$A$1:$C$821,2,FALSE)","v":"Administration"},"Nat_Gas","SATELLITECOLDFOODWAREHOUSE","Cypress, TX",22020,367,36,12,-66.6666666666667,255.31,172.58,-32.403744467510101,0,0,0]
[{"$f":"VLOOKUP(C657,Sheet3!$A$1:$C$821,2,FALSE)","v":"Elementary Schools"},"Nat_Gas","SHERIDANES","Katy, TX",92874,44044,89,177,98.876404494382001,522.63,830.21,58.852342957733001,0,0,0]
[{"$f":"VLOOKUP(C658,Sheet3!$A$1:$C$821,2,FALSE)","v":"Middle Schools"},"Nat_Gas","SMITHMS","Cypress, TX",233159,44044,364,478,31.3186813186813,1613.74,2024.99,25.4842787561813,0,0,0]
[{"$f":"VLOOKUP(C659,Sheet3!$A$1:$C$821,2,FALSE)","v":"Middle Schools"},"Nat_Gas","SPILLANEMS","Cypress, TX",235889,367,1215,1840,51.440329218107003,5086.66,7155.05,40.663028391911404,0,0,0]
[{"$f":"VLOOKUP(C660,Sheet3!$A$1:$C$821,2,FALSE)","v":"Elementary Schools"},"Nat_Gas","SWENKEES","Cypress, TX",107914,367,158,225,42.4050632911392,843.1,1065.8900000000001,26.425097853160999,0,0,0]
[{"$f":"VLOOKUP(C661,Sheet3!$A$1:$C$821,2,FALSE)","v":"Administration"},"Nat_Gas","TELGETRANS","Cypress, TX",19649,367,103,132,28.1553398058252,571.65,671.64,17.4914720545789,0,0,0]
[{"$f":"VLOOKUP(C662,Sheet3!$A$1:$C$821,2,FALSE)","v":"Middle Schools"},"Nat_Gas","THORNTONMS","Katy, TX",202739,44044,821,900,9.6224116930572503,3348.73,3481.06,3.9516473409322299,0,0,0]
[{"$f":"VLOOKUP(C663,Sheet3!$A$1:$C$821,2,FALSE)","v":"Elementary Schools"},"Nat_Gas","TIPPSES","Houston, TX",101727,367,194,276,42.268041237113401,965.75,1250.53,29.487962723272101,0,0,0]
[{"$f":"VLOOKUP(C664,Sheet3!$A$1:$C$821,2,FALSE)","v":"Middle Schools"},"Nat_Gas","TRUITTMS","Houston, TX",209274,43952,559,1400,150.44722719141299,2234.73,4867.18,117.79722830051099,0,0,0]
[{"$f":"VLOOKUP(C665,Sheet3!$A$1:$C$821,2,FALSE)","v":"Elementary Schools"},"Nat_Gas","WALKERES","Katy, TX",98321,367,241,382,58.506224066389997,1015.68,1517.88,49.444706994328897,0,0,0]
[{"$f":"VLOOKUP(C666,Sheet3!$A$1:$C$821,2,FALSE)","v":"Elementary Schools"},"Nat_Gas","WARNERES","Cypress, TX",98451,44044,174,246,41.379310344827601,793.33,1042.0999999999999,31.357694780230201,0,0,0]
[{"$f":"VLOOKUP(C667,Sheet3!$A$1:$C$821,2,FALSE)","v":"Middle Schools"},"Nat_Gas","WATKINSMS","Houston, TX",220237,44044,1434,1938,35.146443514644403,5099.41,6719.73,31.774656283766198,0,0,0]
[{"$f":"VLOOKUP(C668,Sheet3!$A$1:$C$821,2,FALSE)","v":"Elementary Schools"},"Nat_Gas","WELLSES","Cypress, TX",124414,44044,3865,3895,0.77619663648124204,12826.89,12989,1.26382934600671,0,0,0]
[{"$f":"VLOOKUP(C669,Sheet3!$A$1:$C$821,2,FALSE)","v":"Administration"},"Nat_Gas","WESTGREENTRANS","Cypress, TX",45340,367,398,323,-18.844221105527598,1467.3,1217.06,-17.0544537586042,0,0,0]
[{"$f":"VLOOKUP(C670,Sheet3!$A$1:$C$821,2,FALSE)","v":"Elementary Schools"},"Nat_Gas","WILLBERNES","Houston, TX",89993,367,127,267,110.236220472441,648.63,1091.1600000000001,68.225336478423799,0,0,0]
[{"$f":"VLOOKUP(C671,Sheet3!$A$1:$C$821,2,FALSE)","v":"Elementary Schools"},"Nat_Gas","WILSONES","Houston, TX",84992,367,208,300,44.230769230769198,905.39,1187.75,31.186560487745599,0,0,0]
[{"$f":"VLOOKUP(C672,Sheet3!$A$1:$C$821,2,FALSE)","v":"Special Schools"},"Nat_Gas","WINDFERNANNEX","Houston, TX",59400,43952,1179,531,-54.961832061068698,5088.96,2934.93,-42.327508960573503,0,0,0]
[{"$f":"VLOOKUP(C673,Sheet3!$A$1:$C$821,2,FALSE)","v":"Special Schools"},"Nat_Gas","WINDFERNHS","Houston, TX",50022,367,81,91,12.3456790123457,405.55,436.62,7.66120083836765,0,0,0]
[{"$f":"VLOOKUP(C674,Sheet3!$A$1:$C$821,2,FALSE)","v":"Elementary Schools"},"Nat_Gas","WOODARDES","Cypress, TX",116974,44044,148,158,6.7567567567567597,719.36,755.57,5.0336410142348802,0,0,0]
[{"$f":"VLOOKUP(C675,Sheet3!$A$1:$C$821,2,FALSE)","v":"Elementary Schools"},"Nat_Gas","YEAGERES","Houston, TX",81794,367,337,434,28.7833827893175,1416.72,1759.8,24.216500084702702,0,0,0]
[{"$f":"VLOOKUP(C676,Sheet3!$A$1:$C$821,2,FALSE)","v":"Elementary Schools"},"Nat_Gas","ADAM-ES","Houston, TX",103177,367,234,335,43.162393162393201,935.92,1378.92,47.333105393623399,0,0,0]
[{"$f":"VLOOKUP(C677,Sheet3!$A$1:$C$821,2,FALSE)","v":"Special Schools"},"Nat_Gas","ALCABC","Houston, TX",56061,367,165,304,84.242424242424207,737.15,1265.3699999999999,71.657057586651305,0,0,0]
[{"$f":"VLOOKUP(C678,Sheet3!$A$1:$C$821,2,FALSE)","v":"Special Schools"},"Nat_Gas","ALCWEST","Katy, TX",50839,367,683,1000,46.412884333821403,2375.09,3723.3,56.764585763065803,0,0,0]
[{"$f":"VLOOKUP(C679,Sheet3!$A$1:$C$821,2,FALSE)","v":"Elementary Schools"},"Nat_Gas","ANDREES","Cypress, TX",100156,43952,441,754,70.975056689342395,1538.79,2832.85,84.095945515632394,0,0,0]
[{"$f":"VLOOKUP(C680,Sheet3!$A$1:$C$821,2,FALSE)","v":"Middle Schools"},"Nat_Gas","ANTHONYMS","Cypress, TX",244123,367,679,1060,56.111929307805603,2617.96,4237.42,61.8596158841235,0,0,0]
[{"$f":"VLOOKUP(C681,Sheet3!$A$1:$C$821,2,FALSE)","v":"Middle Schools"},"Nat_Gas","ARAGONMS","Houston, TX",219821,367,737,1397,89.552238805970106,2872.6,5347.49,86.155051173153197,0,0,0]
[{"$f":"VLOOKUP(C682,Sheet3!$A$1:$C$821,2,FALSE)","v":"Middle Schools"},"Nat_Gas","ARNOLDMS","Cypress, TX",210699,44409,4656,5684,22.079037800687299,16099.78,21184.52,31.582667589246601,0,0,0]
[{"$f":"VLOOKUP(C683,Sheet3!$A$1:$C$821,2,FALSE)","v":"Elementary Schools"},"Nat_Gas","AULTES","Cypress, TX",91912,43952,170,369,117.058823529412,757.5,1490.71,96.793399339933998,0,0,0]
[{"$f":"VLOOKUP(C684,Sheet3!$A$1:$C$821,2,FALSE)","v":"Elementary Schools"},"Nat_Gas","BANEES","Houston, TX",106804,367,361,764,111.634349030471,1351.5,2856.61,111.365889752127,0,0,0]
[{"$f":"VLOOKUP(C685,Sheet3!$A$1:$C$821,2,FALSE)","v":"Elementary Schools"},"Nat_Gas","BANGES","Houston, TX",89313,44044,188,412,119.14893617021301,808.46,1642.91,103.214753976696,0,0,0]
[{"$f":"VLOOKUP(C686,Sheet3!$A$1:$C$821,2,FALSE)","v":"Administration"},"Nat_Gas","BARKERTRANS","Houston, TX",22677,367,84,120,42.857142857142897,397.98,544.79,36.888788381325703,0,0,0]
[{"$f":"VLOOKUP(C687,Sheet3!$A$1:$C$821,2,FALSE)","v":"Administration"},"Nat_Gas","BERRYCENTER","Cypress, TX",491434,367,1615,1906,18.018575851393202,6676.18,8235.86,23.361862622038402,0,0,0]
[{"$f":"VLOOKUP(C688,Sheet3!$A$1:$C$821,2,FALSE)","v":"Elementary Schools"},"Nat_Gas","BIRKESES","Houston, TX",104952,44044,327,706,115.90214067278301,1347.19,2719.54,101.86759105991,0,0,0]
[{"$f":"VLOOKUP(C689,Sheet3!$A$1:$C$821,2,FALSE)","v":"Elementary Schools"},"Nat_Gas","BLACKES","Cypress, TX",101992,44409,214,411,92.056074766355096,896.83,1624.9,81.182609859170597,0,0,0]
[{"$f":"VLOOKUP(C690,Sheet3!$A$1:$C$821,2,FALSE)","v":"Middle Schools"},"Nat_Gas","BLEYLMS","Houston, TX",234294,44409,1702,2534,48.883666274970601,6072.97,9484.06,56.168398658317102,0,0,0]
["Special Schools","Nat_Gas","BRADLEYPOLICESTATION","Cypress, TX",19680,43952,111,113,1.8018018018018001,474.67,522.07000000000005,9.9858849305833495,0,0,0]
[{"$f":"VLOOKUP(C692,Sheet3!$A$1:$C$821,2,FALSE)","v":{"$error":"#N/A"}},"Nat_Gas","BRAUTIGAMCENTER","Houston, TX",79751,44409,490,701,43.061224489795897,1717.9,2631.67,53.1911054194074,0,0,0]
[{"$f":"VLOOKUP(C693,Sheet3!$A$1:$C$821,2,FALSE)","v":"High Schools"},"Nat_Gas","BRIDGELANDHS","Cypress, TX",579612,44409,437,840,92.219679633867301,2231.6799999999998,4694.16,110.341984513909,0,0,0]
[{"$f":"VLOOKUP(C694,Sheet3!$A$1:$C$821,2,FALSE)","v":"Middle Schools"},"Nat_Gas","CAMPBELLMS","Houston, TX",232217,44409,976,1483,51.9467213114754,3773.79,5842.16,54.808826140299303,0,0,0]
[{"$f":"VLOOKUP(C695,Sheet3!$A$1:$C$821,2,FALSE)","v":"Administration"},"Nat_Gas","CFISDNATATORIUM","Houston, TX",49471,367,10867,4992,-54.062758811079398,33387.54,20855.650000000001,-37.534631182770603,0,0,0]
[{"$f":"VLOOKUP(C696,Sheet3!$A$1:$C$821,2,FALSE)","v":"Middle Schools"},"Nat_Gas","COOKMS","Houston, TX",205797,43952,734,1599,117.847411444142,2764.63,6002.22,117.10753337698,0,0,0]
[{"$f":"VLOOKUP(C697,Sheet3!$A$1:$C$821,2,FALSE)","v":"Elementary Schools"},"Nat_Gas","COPELANDES","Houston, TX",91324,44409,185,212,14.5945945945946,786.96,900.06,14.371759682830101,0,0,0]
[{"$f":"VLOOKUP(C698,Sheet3!$A$1:$C$821,2,FALSE)","v":"High Schools"},"Nat_Gas","CY-CREEKHS","Houston, TX",528099,44409,2998,4979,66.077384923282196,10345.14,18401.080000000002,77.871734940271494,0,0,0]
[{"$f":"VLOOKUP(C699,Sheet3!$A$1:$C$821,2,FALSE)","v":"High Schools"},"Nat_Gas","CY-FALLSAGVOC","Houston, TX",0,367,100,172,72,543.70000000000005,811.12,49.185212433327202,0,0,0]
[{"$f":"VLOOKUP(C700,Sheet3!$A$1:$C$821,2,FALSE)","v":"High Schools"},"Nat_Gas","CY-FALLSHS","Houston, TX",565245,44409,1735,2576,48.472622478386199,6179.27,9857.33,59.522564963175299,0,0,0]
[{"$f":"VLOOKUP(C701,Sheet3!$A$1:$C$821,2,FALSE)","v":"High Schools"},"Nat_Gas","CY-LAKESHS","Katy, TX",514068,43952,3144,3131,-0.41348600508905903,11122.74,12239.27,10.038263952946799,0,0,0]
[{"$f":"VLOOKUP(C702,Sheet3!$A$1:$C$821,2,FALSE)","v":"High Schools"},"Nat_Gas","CY-PARKHS","Cypress, TX",590057,367,5196,7815,50.404157043879898,16817.03,29072.36,72.874520649603397,0,0,0]
[{"$f":"VLOOKUP(C703,Sheet3!$A$1:$C$821,2,FALSE)","v":{"$error":"#N/A"}},"Nat_Gas","Cypress Fairbanks ISD","",null,null,0,10,0,0,1000,0,0,null,0]
[{"$f":"VLOOKUP(C704,Sheet3!$A$1:$C$821,2,FALSE)","v":"High Schools"},"Nat_Gas","CY-RANCHHS","Cypress, TX",527481,44409,2200,3485,58.409090909090899,8075.37,13301.99,64.722978637511304,0,0,0]
[{"$f":"VLOOKUP(C705,Sheet3!$A$1:$C$821,2,FALSE)","v":"High Schools"},"Nat_Gas","CY-RIDGEHS","Houston, TX",502564,44044,2321,3838,65.359758724687595,8355.11,14284.18,70.963398447177795,0,0,0]
[{"$f":"VLOOKUP(C706,Sheet3!$A$1:$C$821,2,FALSE)","v":"High Schools"},"Nat_Gas","CY-SPRINGSHS","Cypress, TX",478615,44044,3032,3066,1.12137203166227,10284.549999999999,11771.95,14.4624704046361,0,0,0]
[{"$f":"VLOOKUP(C707,Sheet3!$A$1:$C$821,2,FALSE)","v":"Special Schools"},"Nat_Gas","CY-WOODSCARLTONCENTERKITCHEN","Cypress, TX",37977,367,11,14,27.272727272727298,261.93,276.41000000000003,5.5281945557973504,0,0,0]
[{"$f":"VLOOKUP(C708,Sheet3!$A$1:$C$821,2,FALSE)","v":"High Schools"},"Nat_Gas","CY-WOODSHS","Cypress, TX",501359,44409,2877,4334,50.643030935001697,10173.26,16339.86,60.6157711490712,0,0,0]
[{"$f":"VLOOKUP(C709,Sheet3!$A$1:$C$821,2,FALSE)","v":"Elementary Schools"},"Nat_Gas","DANISHES","Houston, TX",98052,43952,271,443,63.468634686346903,1075.3499999999999,1725.65,60.473334263263098,0,0,0]
[{"$f":"VLOOKUP(C710,Sheet3!$A$1:$C$821,2,FALSE)","v":"Middle Schools"},"Nat_Gas","DEANMS","Houston, TX",222788,44044,627,1162,85.326953748006403,2750.29,4809.68,74.879012758654497,0,0,0]
[{"$f":"VLOOKUP(C711,Sheet3!$A$1:$C$821,2,FALSE)","v":"Elementary Schools"},"Nat_Gas","DURYEAES","Katy, TX",96423,43952,160,514,221.25,725.65,1967.64,171.15551574450501,0,0,0]
[{"$f":"VLOOKUP(C712,Sheet3!$A$1:$C$821,2,FALSE)","v":"Administration"},"Nat_Gas","ELC1","Houston, TX",6832,367,1,10,900,140.76,171.8,22.051719238419999,0,0,0]
[{"$f":"VLOOKUP(C713,Sheet3!$A$1:$C$821,2,FALSE)","v":"Administration"},"Nat_Gas","ELDRIDGETRANS","Houston, TX",19256,44044,129,183,41.860465116279101,626.24,848.85,35.547074603985699,0,0,0]
[{"$f":"VLOOKUP(C714,Sheet3!$A$1:$C$821,2,FALSE)","v":"Elementary Schools"},"Nat_Gas","EMERYES","Katy, TX",98438,44044,130,337,159.230769230769,631.44000000000005,1373,117.439503357405,0,0,0]
[{"$f":"VLOOKUP(C715,Sheet3!$A$1:$C$821,2,FALSE)","v":"Elementary Schools"},"Nat_Gas","EMMOTTES","Houston, TX",77394,43952,113,230,103.53982300884999,573.77,1014.91,76.884465900970795,0,0,0]
[{"$f":"VLOOKUP(C716,Sheet3!$A$1:$C$821,2,FALSE)","v":"Administration"},"Nat_Gas","EXHIBITCENTERSCIENCERESOURCEC","Cypress, TX",72198,367,518,466,-10.038610038610001,1888.68,1920.32,1.67524408581655,0,0,0]
[{"$f":"VLOOKUP(C717,Sheet3!$A$1:$C$821,2,FALSE)","v":"Administration"},"Nat_Gas","FALCONCOMPLEX","Houston, TX",0,367,376,379,0.79787234042553201,1396.16,1517.63,8.7002922301168901,0,0,0]
[{"$f":"VLOOKUP(C718,Sheet3!$A$1:$C$821,2,FALSE)","v":"Elementary Schools"},"Nat_Gas","FARNEYES","Cypress, TX",95036,367,711,1201,68.917018284106902,2585.8200000000002,4533.75,75.331229551940993,0,0,0]
[{"$f":"VLOOKUP(C719,Sheet3!$A$1:$C$821,2,FALSE)","v":"Elementary Schools"},"Nat_Gas","FIESTES","Houston, TX",91621,367,147,228,55.1020408163265,673.31,1009.67,49.956186600525797,0,0,0]
[{"$f":"VLOOKUP(C720,Sheet3!$A$1:$C$821,2,FALSE)","v":"Administration"},"Nat_Gas","FOODPRODUCTIONCENTER","Houston, TX",57684,367,5839,8049,37.848946737455002,20881.650000000001,31081.360000000001,48.845325920126001,0,0,0]
[{"$f":"VLOOKUP(C721,Sheet3!$A$1:$C$821,2,FALSE)","v":"Administration"},"Nat_Gas","FOODSERVICEWAREHOUSE","Houston, TX",48487,43952,317,425,34.069400630914799,1116.17,1573.57,40.979420697564002,0,0,0]
[{"$f":"VLOOKUP(C722,Sheet3!$A$1:$C$821,2,FALSE)","v":"Elementary Schools"},"Nat_Gas","FRANCONEES","Houston, TX",88982,44409,213,340,59.624413145539897,873.93,1392.72,59.362878033709798,0,0,0]
[{"$f":"VLOOKUP(C723,Sheet3!$A$1:$C$821,2,FALSE)","v":"Elementary Schools"},"Nat_Gas","GLEASONES","Houston, TX",91424,367,351,747,112.820512820513,1323.55,2761.21,108.621510332062,0,0,0]
[{"$f":"VLOOKUP(C724,Sheet3!$A$1:$C$821,2,FALSE)","v":"Middle Schools"},"Nat_Gas","GOODSONMS","Cypress, TX",218801,367,1170,1818,55.384615384615401,3878.39,6713.56,73.101725200405298,0,0,0]
[{"$f":"VLOOKUP(C725,Sheet3!$A$1:$C$821,2,FALSE)","v":"Elementary Schools"},"Nat_Gas","HAIRGROVEES","Houston, TX",90830,44409,159,661,315.72327044025201,717.84,2495.1799999999998,247.59556447119101,0,0,0]
[{"$f":"VLOOKUP(C726,Sheet3!$A$1:$C$821,2,FALSE)","v":"Elementary Schools"},"Nat_Gas","HAMILTONES","Cypress, TX",89692,44044,151,295,95.364238410596002,696.13,1235.54,77.486963641848504,0,0,0]
[{"$f":"VLOOKUP(C727,Sheet3!$A$1:$C$821,2,FALSE)","v":"Middle Schools"},"Nat_Gas","HAMILTONMS","Cypress, TX",194726,44044,686,1215,77.113702623906704,2547.42,4588.8999999999996,80.139121150026298,0,0,0]
[{"$f":"VLOOKUP(C728,Sheet3!$A$1:$C$821,2,FALSE)","v":"Elementary Schools"},"Nat_Gas","HANCOCKES","Houston, TX",87259,44409,414,613,48.067632850241502,1482.72,2405.9499999999998,62.265970648537802,0,0,0]
[{"$f":"VLOOKUP(C729,Sheet3!$A$1:$C$821,2,FALSE)","v":"Elementary Schools"},"Nat_Gas","HEMMENWAYES","Katy, TX",101091,44044,316,706,123.41772151898699,1187.8499999999999,2672,124.94422696468401,0,0,0]
[{"$f":"VLOOKUP(C730,Sheet3!$A$1:$C$821,2,FALSE)","v":"Elementary Schools"},"Nat_Gas","HOLBROOKES","Houston, TX",99937,367,310,490,58.064516129032299,1296.9100000000001,2022.46,55.944514268530597,0,0,0]
[{"$f":"VLOOKUP(C731,Sheet3!$A$1:$C$821,2,FALSE)","v":"Elementary Schools"},"Nat_Gas","HOLMSLEYES","Houston, TX",81704,44044,273,477,74.725274725274701,1045.1500000000001,1881.41,80.013395206429706,0,0,0]
[{"$f":"VLOOKUP(C732,Sheet3!$A$1:$C$821,2,FALSE)","v":"Elementary Schools"},"Nat_Gas","HOOVERES","Katy, TX",112519,367,279,838,200.35842293906799,1081.53,3189.49,194.905365546957,0,0,0]
[{"$f":"VLOOKUP(C733,Sheet3!$A$1:$C$821,2,FALSE)","v":"Middle Schools"},"Nat_Gas","HOPPERMS","Cypress, TX",226178,367,1061,1756,65.504241281809598,3942.3,6674.46,69.303705958450607,0,0,0]
[{"$f":"VLOOKUP(C734,Sheet3!$A$1:$C$821,2,FALSE)","v":"Elementary Schools"},"Nat_Gas","HORNEES","Houston, TX",95855,44409,242,414,71.074380165289298,980.17,1627.71,66.064050113755798,0,0,0]
[{"$f":"VLOOKUP(C735,Sheet3!$A$1:$C$821,2,FALSE)","v":"Administration"},"Nat_Gas","ISCA","Houston, TX",132467,367,224,479,113.83928571428601,1010.11,1951.42,93.188860619140499,0,0,0]
[{"$f":"VLOOKUP(C736,Sheet3!$A$1:$C$821,2,FALSE)","v":"Administration"},"Nat_Gas","ISCW","Houston, TX",35364,367,150,310,106.666666666667,696.18,1287.33,84.913384469533696,0,0,0]
[{"$f":"VLOOKUP(C737,Sheet3!$A$1:$C$821,2,FALSE)","v":"High Schools"},"Nat_Gas","JERSEYVILLAGEHS","Houston, TX",513823,44409,1547,2766,78.797672915320007,5197.25,10393.18,99.974601952955894,0,0,0]
[{"$f":"VLOOKUP(C738,Sheet3!$A$1:$C$821,2,FALSE)","v":"Elementary Schools"},"Nat_Gas","JOWELLES","Katy, TX",73726,367,166,274,65.060240963855406,736.74,1166.06,58.2729321063062,0,0,0]
[{"$f":"VLOOKUP(C739,Sheet3!$A$1:$C$821,2,FALSE)","v":"Middle Schools"},"Nat_Gas","KAHLAMS","Houston, TX",221601,367,952,1586,66.596638655462201,3616.46,6242.74,72.620186591307501,0,0,0]
[{"$f":"VLOOKUP(C740,Sheet3!$A$1:$C$821,2,FALSE)","v":"Elementary Schools"},"Nat_Gas","KEITHES","Cypress, TX",95518,367,240,435,81.25,1069.81,1794.52,67.741935483871003,0,0,0]
[{"$f":"VLOOKUP(C741,Sheet3!$A$1:$C$821,2,FALSE)","v":"Elementary Schools"},"Nat_Gas","KIRKES","Houston, TX",93897,367,227,520,129.07488986784099,1005.12,2081.2600000000002,107.06582298631,0,0,0]
[{"$f":"VLOOKUP(C742,Sheet3!$A$1:$C$821,2,FALSE)","v":"Middle Schools"},"Nat_Gas","LABAYMS","Houston, TX",190510,43952,584,1424,143.835616438356,2220.06,5282.24,137.93230813581599,0,0,0]
[{"$f":"VLOOKUP(C743,Sheet3!$A$1:$C$821,2,FALSE)","v":"Elementary Schools"},"Nat_Gas","LAMKINES","Cypress, TX",113622,43956,272,431,58.455882352941202,1071.5,1691.66,57.877741483901097,0,0,0]
[{"$f":"VLOOKUP(C744,Sheet3!$A$1:$C$821,2,FALSE)","v":"High Schools"},"Nat_Gas","LANGHAMCREEKHS","Houston, TX",536036,44409,1869,2322,24.237560192616399,5887.88,8835.0400000000009,50.054688614577699,0,0,0]
[{"$f":"VLOOKUP(C745,Sheet3!$A$1:$C$821,2,FALSE)","v":"Administration"},"Nat_Gas","LANGHAMCREEKRETENTIONPOND","Houston, TX",0,367,18,13,-27.7777777777778,195.11,183.69,-5.8531085028958003,0,0,0]
[{"$f":"VLOOKUP(C746,Sheet3!$A$1:$C$821,2,FALSE)","v":"Elementary Schools"},"Nat_Gas","LEEES","Houston, TX",95352,367,729,530,-27.297668038408801,2535.54,2124.0300000000002,-16.2296788849713,0,0,0]
[{"$f":"VLOOKUP(C747,Sheet3!$A$1:$C$821,2,FALSE)","v":"Elementary Schools"},"Nat_Gas","LIEDERES","Houston, TX",83798,44440,311,292,-6.1093247588424404,1289.05,1311.26,1.7229742833869901,0,0,0]
[{"$f":"VLOOKUP(C748,Sheet3!$A$1:$C$821,2,FALSE)","v":"Elementary Schools"},"Nat_Gas","LOWERYES","Houston, TX",92034,44409,0,206,0,137.79,842.7,511.58284345743499,0,0,0]
[{"$f":"VLOOKUP(C749,Sheet3!$A$1:$C$821,2,FALSE)","v":"Administration"},"Nat_Gas","MAINTENANCEOPER","Houston, TX",36679,43952,110,235,113.636363636364,551.35,1028.1199999999999,86.473202140201295,0,0,0]
[{"$f":"VLOOKUP(C750,Sheet3!$A$1:$C$821,2,FALSE)","v":"Elementary Schools"},"Nat_Gas","MATZKEMILLSES","Houston, TX",127754,44440,444,709,59.684684684684697,1667.7,3031.17,81.757510343587001,0,0,0]
[{"$f":"VLOOKUP(C751,Sheet3!$A$1:$C$821,2,FALSE)","v":"Elementary Schools"},"Nat_Gas","MCFEEES","Katy, TX",105539,367,341,670,96.480938416422305,1371.15,2601.5,89.731247492980302,0,0,0]
[{"$f":"VLOOKUP(C752,Sheet3!$A$1:$C$821,2,FALSE)","v":"Elementary Schools"},"Nat_Gas","METCALFES","Houston, TX",85120,43956,211,274,29.857819905213301,880.35,1156.72,31.393195887999099,0,0,0]
[{"$f":"VLOOKUP(C753,Sheet3!$A$1:$C$821,2,FALSE)","v":"Elementary Schools"},"Nat_Gas","MILLSAPES","Cypress, TX",94477,44409,212,901,325,888.87,3335.42,275.24272390788298,0,0,0]
[{"$f":"VLOOKUP(C754,Sheet3!$A$1:$C$821,2,FALSE)","v":"Elementary Schools"},"Nat_Gas","MOOREES","Houston, TX",83063,43952,217,447,105.99078341013799,893.09,1744.47,95.329698014757795,0,0,0]
[{"$f":"VLOOKUP(C755,Sheet3!$A$1:$C$821,2,FALSE)","v":"Elementary Schools"},"Nat_Gas","OWENSES","Houston, TX",87177,44409,283,455,60.777385159010599,1080.72,1787.87,65.433229698719401,0,0,0]
[{"$f":"VLOOKUP(C756,Sheet3!$A$1:$C$821,2,FALSE)","v":"Elementary Schools"},"Nat_Gas","POPEES","Cypress, TX",112970,367,288,440,52.7777777777778,1112.29,1725.27,55.1097285779788,0,0,0]
[{"$f":"VLOOKUP(C757,Sheet3!$A$1:$C$821,2,FALSE)","v":"Elementary Schools"},"Nat_Gas","POSTES","Houston, TX",104852,367,604,779,28.9735099337748,2225.23,3043.48,36.771479802087903,0,0,0]
[{"$f":"VLOOKUP(C758,Sheet3!$A$1:$C$821,2,FALSE)","v":"Elementary Schools"},"Nat_Gas","POSTMAES","Cypress, TX",98920,367,310,401,29.354838709677399,1189.2,1585.28,33.306424487050101,0,0,0]
[{"$f":"VLOOKUP(C759,Sheet3!$A$1:$C$821,2,FALSE)","v":"Administration"},"Nat_Gas","PRIDGEONSTADIUM","Houston, TX",86181,367,23,73,217.39130434782601,209.44,388.84,85.656990068754794,0,0,0]
[{"$f":"VLOOKUP(C760,Sheet3!$A$1:$C$821,2,FALSE)","v":"Elementary Schools"},"Nat_Gas","REEDES","Houston, TX",90012,367,187,267,42.780748663101598,801.27,1134.75,41.618929948706402,0,0,0]
[{"$f":"VLOOKUP(C761,Sheet3!$A$1:$C$821,2,FALSE)","v":"Elementary Schools"},"Nat_Gas","RENNELLES","Cypress, TX",118229,44409,249,394,58.232931726907601,1004.64,1570.14,56.288819875776397,0,0,0]
[{"$f":"VLOOKUP(C762,Sheet3!$A$1:$C$821,2,FALSE)","v":"Elementary Schools"},"Nat_Gas","ROBINSONES","Katy, TX",101604,44409,132,350,165.15151515151501,633.57000000000005,1428.14,125.411556734063,0,0,0]
[{"$f":"VLOOKUP(C763,Sheet3!$A$1:$C$821,2,FALSE)","v":"Elementary Schools"},"Nat_Gas","ROBISONES","Cypress, TX",93882,43952,196,450,129.591836734694,833.96,1763.1,111.413017410907,0,0,0]
[{"$f":"VLOOKUP(C764,Sheet3!$A$1:$C$821,2,FALSE)","v":{"$error":"#N/A"}},"Nat_Gas","ROWEMS","Cypress, TX",271966,367,0,208,0,0,1340.16,0,0,null,0]
[{"$f":"VLOOKUP(C765,Sheet3!$A$1:$C$821,2,FALSE)","v":"Middle Schools"},"Nat_Gas","SALYARDSMS","Cypress, TX",242116,43952,326,896,174.846625766871,1413.8,3462.05,144.87551280237699,0,0,0]
[{"$f":"VLOOKUP(C766,Sheet3!$A$1:$C$821,2,FALSE)","v":"Elementary Schools"},"Nat_Gas","SAMPSONES","Cypress, TX",96096,367,191,413,116.230366492147,825.23,1627.78,97.2516752905251,0,0,0]
[{"$f":"VLOOKUP(C767,Sheet3!$A$1:$C$821,2,FALSE)","v":"Administration"},"Nat_Gas","SATELLITECOLDFOODWAREHOUSE","Cypress, TX",22020,367,16,15,-6.25,184.51,189.76,2.84537423445884,0,0,0]
[{"$f":"VLOOKUP(C768,Sheet3!$A$1:$C$821,2,FALSE)","v":"Elementary Schools"},"Nat_Gas","SHERIDANES","Katy, TX",92874,44044,99,222,124.24242424242399,536.29,996.83,85.875179473792201,0,0,0]
[{"$f":"VLOOKUP(C769,Sheet3!$A$1:$C$821,2,FALSE)","v":"Middle Schools"},"Nat_Gas","SMITHMS","Cypress, TX",233159,44044,397,705,77.581863979848904,1645.26,2802.92,70.363346826641404,0,0,0]
[{"$f":"VLOOKUP(C770,Sheet3!$A$1:$C$821,2,FALSE)","v":"Middle Schools"},"Nat_Gas","SPILLANEMS","Cypress, TX",235889,367,1587,1815,14.366729678638899,5921.9,7179.53,21.236934092098799,0,0,0]
[{"$f":"VLOOKUP(C771,Sheet3!$A$1:$C$821,2,FALSE)","v":"Elementary Schools"},"Nat_Gas","SWENKEES","Cypress, TX",107914,367,248,557,124.596774193548,1084.07,2221.96,104.96462405564201,0,0,0]
[{"$f":"VLOOKUP(C772,Sheet3!$A$1:$C$821,2,FALSE)","v":"Administration"},"Nat_Gas","TELGETRANS","Cypress, TX",19649,367,109,201,84.403669724770594,565.4,912.29,61.353024407499099,0,0,0]
[{"$f":"VLOOKUP(C773,Sheet3!$A$1:$C$821,2,FALSE)","v":{"$error":"#N/A"}},"Nat_Gas","TEST","Houston, TX",0,367,0,87.417400000000001,0,0,482,0,0,null,0]
[{"$f":"VLOOKUP(C774,Sheet3!$A$1:$C$821,2,FALSE)","v":"Middle Schools"},"Nat_Gas","THORNTONMS","Katy, TX",202739,44044,1008,1002,-0.59523809523809501,3655.62,4113.72,12.5313900241272,0,0,0]
[{"$f":"VLOOKUP(C775,Sheet3!$A$1:$C$821,2,FALSE)","v":"Elementary Schools"},"Nat_Gas","TIPPSES","Houston, TX",101727,367,256,398,55.46875,1104.93,1675.04,51.596933742409,0,0,0]
[{"$f":"VLOOKUP(C776,Sheet3!$A$1:$C$821,2,FALSE)","v":"Middle Schools"},"Nat_Gas","TRUITTMS","Houston, TX",209274,43952,708,1142,61.299435028248602,2558.87,4318.57,68.768636155803193,0,0,0]
[{"$f":"VLOOKUP(C777,Sheet3!$A$1:$C$821,2,FALSE)","v":"Elementary Schools"},"Nat_Gas","WALKERES","Katy, TX",98321,367,271,546,101.476014760148,1068.42,2080.94,94.767975140862205,0,0,0]
[{"$f":"VLOOKUP(C778,Sheet3!$A$1:$C$821,2,FALSE)","v":"Elementary Schools"},"Nat_Gas","WARNERES","Cypress, TX",98451,44044,224,464,107.142857142857,921.61,1818.95,97.366565032931504,0,0,0]
[{"$f":"VLOOKUP(C779,Sheet3!$A$1:$C$821,2,FALSE)","v":"Middle Schools"},"Nat_Gas","WATKINSMS","Houston, TX",220237,44044,1698,2183,28.563015312131899,5499.48,8104.55,47.369387651196099,0,0,0]
[{"$f":"VLOOKUP(C780,Sheet3!$A$1:$C$821,2,FALSE)","v":"Elementary Schools"},"Nat_Gas","WELLSES","Cypress, TX",124414,44044,3338,4431,32.744158178550002,10384.469999999999,15570.14,49.936780596409797,0,0,0]
[{"$f":"VLOOKUP(C781,Sheet3!$A$1:$C$821,2,FALSE)","v":"Administration"},"Nat_Gas","WESTGREENTRANS","Cypress, TX",45340,367,534,648,21.348314606741599,1791.01,2348.73,31.139971301109401,0,0,0]
[{"$f":"VLOOKUP(C782,Sheet3!$A$1:$C$821,2,FALSE)","v":"Elementary Schools"},"Nat_Gas","WILLBERNES","Houston, TX",89993,367,156,340,117.948717948718,711.46,1387.89,95.076321929553302,0,0,0]
[{"$f":"VLOOKUP(C783,Sheet3!$A$1:$C$821,2,FALSE)","v":"Elementary Schools"},"Nat_Gas","WILSONES","Houston, TX",84992,367,256,387,51.171875,1005.91,1541.52,53.2463142825899,0,0,0]
[{"$f":"VLOOKUP(C784,Sheet3!$A$1:$C$821,2,FALSE)","v":"Special Schools"},"Nat_Gas","WINDFERNANNEX","Houston, TX",59400,43952,1732,1181,-31.812933025404199,6489.44,5131.8500000000004,-20.919986932616698,0,0,0]
[{"$f":"VLOOKUP(C785,Sheet3!$A$1:$C$821,2,FALSE)","v":"Special Schools"},"Nat_Gas","WINDFERNHS","Houston, TX",50022,367,100,137,37,443.56,605.70000000000005,36.554242943457503,0,0,0]
[{"$f":"VLOOKUP(C786,Sheet3!$A$1:$C$821,2,FALSE)","v":"Elementary Schools"},"Nat_Gas","WOODARDES","Cypress, TX",116974,44044,148,313,111.486486486486,684.41,1298.1400000000001,89.672856913253696,0,0,0]
[{"$f":"VLOOKUP(C787,Sheet3!$A$1:$C$821,2,FALSE)","v":"Elementary Schools"},"Nat_Gas","YEAGERES","Houston, TX",81794,367,370,442,19.459459459459499,1452.39,1814.18,24.909975970641501,0,0,0]
[{"$f":"VLOOKUP(C788,Sheet3!$A$1:$C$821,2,FALSE)","v":"Middle Schools"},"Fire","ANTHONYMS","Cypress, TX",244123,367,1,0,-100,153.96,150,-2.57209664848012,0,0,0]
[{"$f":"VLOOKUP(C789,Sheet3!$A$1:$C$821,2,FALSE)","v":"Administration"},"Fire","BERRYCENTER","Cypress, TX",491434,367,51,15,-70.588235294117695,1816.29,1687.5,-7.0908280065408098,0,0,0]
[{"$f":"VLOOKUP(C790,Sheet3!$A$1:$C$821,2,FALSE)","v":"Middle Schools"},"Fire","BLEYLMS","Houston, TX",234294,44409,0.09,2.76,2966.6666666666702,4611.38,4623.3500000000004,0.25957522477002498,0,0,0]
[{"$f":"VLOOKUP(C791,Sheet3!$A$1:$C$821,2,FALSE)","v":"High Schools"},"Fire","CY-LAKESHS","Katy, TX",514068,43952,24,33,37.5,451.9,478.38,5.8597034742199599,0,0,0]
[{"$f":"VLOOKUP(C792,Sheet3!$A$1:$C$821,2,FALSE)","v":"High Schools"},"Fire","CY-WOODSHS","Cypress, TX",501359,44409,0,0,0,300,300,0,0,0,0]
[{"$f":"VLOOKUP(C793,Sheet3!$A$1:$C$821,2,FALSE)","v":"Middle Schools"},"Fire","DEANMS","Houston, TX",222788,44044,0,0,0,591.66,612.36,3.4986309704898102,0,0,0]
[{"$f":"VLOOKUP(C794,Sheet3!$A$1:$C$821,2,FALSE)","v":"Elementary Schools"},"Fire","EMERYES","Katy, TX",98438,44044,0,0,0,330,330,0,0,0,0]
[{"$f":"VLOOKUP(C795,Sheet3!$A$1:$C$821,2,FALSE)","v":"Elementary Schools"},"Fire","EMMOTTES","Houston, TX",77394,43952,8,3,-62.5,108.35,91.05,-15.9667743424089,0,0,0]
[{"$f":"VLOOKUP(C796,Sheet3!$A$1:$C$821,2,FALSE)","v":"Elementary Schools"},"Fire","FARNEYES","Cypress, TX",95036,367,0,0,0,150,150,0,0,0,0]
[{"$f":"VLOOKUP(C797,Sheet3!$A$1:$C$821,2,FALSE)","v":"Elementary Schools"},"Fire","FRAZIERES","Houston, TX",85844,367,0,0,0,0,90,0,0,null,0]
[{"$f":"VLOOKUP(C798,Sheet3!$A$1:$C$821,2,FALSE)","v":"Middle Schools"},"Fire","GOODSONMS","Cypress, TX",218801,367,0,0,0,150,150,0,0,0,0]
[{"$f":"VLOOKUP(C799,Sheet3!$A$1:$C$821,2,FALSE)","v":"Elementary Schools"},"Fire","HEMMENWAYES","Katy, TX",101091,44044,1,4,300,117.25,128.08000000000001,9.23667377398721,0,0,0]
[{"$f":"VLOOKUP(C800,Sheet3!$A$1:$C$821,2,FALSE)","v":"Elementary Schools"},"Fire","LOWERYES","Houston, TX",78614,43956,0,0,0,0,0,0,0,null,0]
[{"$f":"VLOOKUP(C801,Sheet3!$A$1:$C$821,2,FALSE)","v":"Elementary Schools"},"Fire","METCALFES","Houston, TX",85120,43956,0,0,0,966,966,0,0,0,0]
[{"$f":"VLOOKUP(C802,Sheet3!$A$1:$C$821,2,FALSE)","v":"Elementary Schools"},"Fire","MOOREES","Houston, TX",83063,43952,0,1,0,96,100.25,4.4270833333333304,0,0,0]
[{"$f":"VLOOKUP(C803,Sheet3!$A$1:$C$821,2,FALSE)","v":"Elementary Schools"},"Fire","POSTMAES","Cypress, TX",98920,367,0,0,0,18.100000000000001,0,-100,null,0]
[{"$f":"VLOOKUP(C804,Sheet3!$A$1:$C$821,2,FALSE)","v":"Elementary Schools"},"Fire","RENNELLES","Cypress, TX",118229,44409,0,0,0,150,150,0,0,0,0]
[{"$f":"VLOOKUP(C805,Sheet3!$A$1:$C$821,2,FALSE)","v":"Elementary Schools"},"Fire","ROBINSONES","Katy, TX",101604,44409,0,0,0,144,144,0,0,0,0]
[{"$f":"VLOOKUP(C806,Sheet3!$A$1:$C$821,2,FALSE)","v":"Elementary Schools"},"Fire","ROBISONES","Cypress, TX",93882,43952,0,0,0,150,150,0,0,0,0]
[{"$f":"VLOOKUP(C807,Sheet3!$A$1:$C$821,2,FALSE)","v":"Administration"},"Fire","SATELLITECOLDFOODWAREHOUSE","Cypress, TX",22020,367,0,0,0,150,150,0,0,0,0]
[{"$f":"VLOOKUP(C808,Sheet3!$A$1:$C$821,2,FALSE)","v":"Middle Schools"},"Fire","SMITHMS","Cypress, TX",234695,44409,0,5,0,90,116.8,29.7777777777778,0,0,0]
[{"$f":"VLOOKUP(C809,Sheet3!$A$1:$C$821,2,FALSE)","v":"Middle Schools"},"Fire","TRUITTMS","Houston, TX",209274,43952,28,2,-92.857142857142904,334.56,187.28,-44.021999043519799,0,0,0]
[{"$f":"VLOOKUP(C810,Sheet3!$A$1:$C$821,2,FALSE)","v":"Elementary Schools"},"Fire","WARNERES","Cypress, TX",98451,44044,1,0,-100,93.69,90,-3.9385206532180601,0,0,0]
[{"$f":"VLOOKUP(C811,Sheet3!$A$1:$C$821,2,FALSE)","v":"Elementary Schools"},"Fire","YEAGERES","Houston, TX",81794,367,0,0,0,0,30,0,0,null,0]
[{"$f":"VLOOKUP(C812,Sheet3!$A$1:$C$821,2,FALSE)","v":"Middle Schools"},"Fire","ANTHONYMS","Cypress, TX",244123,"1901-01-01",1,2,100,153.96,158.47999999999999,2.9358274876591302,0,0,0]
[{"$f":"VLOOKUP(C813,Sheet3!$A$1:$C$821,2,FALSE)","v":"Administration"},"Fire","BERRYCENTER","Cypress, TX",491434,"1901-01-01",30,36,20,1746.9,1780.74,1.9371458011334399,0,0,0]
[{"$f":"VLOOKUP(C814,Sheet3!$A$1:$C$821,2,FALSE)","v":"Middle Schools"},"Fire","BLEYLMS","Houston, TX",229363,"1901-01-01",0.64900000000000002,2.67,311.40215716486898,4614.09,4623.99,0.21456018413164901,0,0,0]
[{"$f":"VLOOKUP(C815,Sheet3!$A$1:$C$821,2,FALSE)","v":"High Schools"},"Fire","CY-LAKESHS","Katy, TX",514068,"2020-05-01",27,66,144.444444444444,442.44,681.06,53.9327366422566,0,0,0]
[{"$f":"VLOOKUP(C816,Sheet3!$A$1:$C$821,2,FALSE)","v":"High Schools"},"Fire","CY-WOODSHS","Cypress, TX",501009,"2020-08-01",0,0,0,300,300,0,0,0,0]
[{"$f":"VLOOKUP(C817,Sheet3!$A$1:$C$821,2,FALSE)","v":"Middle Schools"},"Fire","DEANMS","Houston, TX",222788,"2020-08-01",0,0,0,602.01,616.95000000000005,2.4816863507250702,0,0,0]
[{"$f":"VLOOKUP(C818,Sheet3!$A$1:$C$821,2,FALSE)","v":"Elementary Schools"},"Fire","EMERYES","Katy, TX",98438,"2020-08-01",0,97,0,330,876.02,165.46060606060601,0,0,0]
[{"$f":"VLOOKUP(C819,Sheet3!$A$1:$C$821,2,FALSE)","v":"Elementary Schools"},"Fire","EMMOTTES","Houston, TX",77394,"2020-05-01",78,93,19.230769230769202,462.8,590.1,27.506482281763201,0,0,0]
[{"$f":"VLOOKUP(C820,Sheet3!$A$1:$C$821,2,FALSE)","v":"Elementary Schools"},"Fire","FARNEYES","Cypress, TX",95036,"1901-01-01",0,0,0,150,150,0,0,0,0]
[{"$f":"VLOOKUP(C821,Sheet3!$A$1:$C$821,2,FALSE)","v":"Elementary Schools"},"Fire","FRAZIERES","Houston, TX",85844,"1901-01-01",0,0,0,0,540,0,0,null,0]
[{"$f":"VLOOKUP(C822,Sheet3!$A$1:$C$821,2,FALSE)","v":"Middle Schools"},"Fire","GOODSONMS","Cypress, TX",218801,"1901-01-01",0,0,0,150,150,0,0,0,0]
[{"$f":"VLOOKUP(C823,Sheet3!$A$1:$C$821,2,FALSE)","v":"Elementary Schools"},"Fire","HEMMENWAYES","Katy, TX",101091,"2020-08-01",9,10,11.1111111111111,164.68,152,-7.69978139421909,0,0,0]
[{"$f":"VLOOKUP(C824,Sheet3!$A$1:$C$821,2,FALSE)","v":"Elementary Schools"},"Fire","LOWERYES","Houston, TX",78614,"2020-05-05",0,0,0,0,0,0,0,null,0]
[{"$f":"VLOOKUP(C825,Sheet3!$A$1:$C$821,2,FALSE)","v":"Elementary Schools"},"Fire","METCALFES","Houston, TX",85120,"2020-05-05",0,0,0,966,966,0,0,0,0]
[{"$f":"VLOOKUP(C826,Sheet3!$A$1:$C$821,2,FALSE)","v":"Elementary Schools"},"Fire","MOOREES","Houston, TX",83063,"2020-05-01",0,0,0,96,96,0,0,0,0]
[{"$f":"VLOOKUP(C827,Sheet3!$A$1:$C$821,2,FALSE)","v":"Elementary Schools"},"Fire","RENNELLES","Cypress, TX",113621,"2019-08-01",0,0,0,150,150,0,0,0,0]
[{"$f":"VLOOKUP(C828,Sheet3!$A$1:$C$821,2,FALSE)","v":"Elementary Schools"},"Fire","ROBINSONES","Katy, TX",98532,"2020-05-05",0,0,0,144,144,0,0,0,0]
[{"$f":"VLOOKUP(C829,Sheet3!$A$1:$C$821,2,FALSE)","v":"Elementary Schools"},"Fire","ROBISONES","Cypress, TX",93882,"2020-05-01",0,0,0,150,153.75,2.5,0,0,0]
[{"$f":"VLOOKUP(C830,Sheet3!$A$1:$C$821,2,FALSE)","v":"Administration"},"Fire","SATELLITECOLDFOODWAREHOUSE","Cypress, TX",22020,"1901-01-01",0,4,0,150,168.72,12.48,0,0,0]
[{"$f":"VLOOKUP(C831,Sheet3!$A$1:$C$821,2,FALSE)","v":"Middle Schools"},"Fire","SMITHMS","Cypress, TX",233159,"2020-08-01",96,0,-100,631.16,90,-85.740541225679706,0,0,0]
[{"$f":"VLOOKUP(C832,Sheet3!$A$1:$C$821,2,FALSE)","v":"Middle Schools"},"Fire","TRUITTMS","Houston, TX",209274,"2020-05-01",0,0,0,180,180,0,0,0,0]
[{"$f":"VLOOKUP(C833,Sheet3!$A$1:$C$821,2,FALSE)","v":"Elementary Schools"},"Fire","WARNERES","Cypress, TX",98451,"2020-08-01",0,0,0,90,90,0,0,0,0]
[{"$f":"VLOOKUP(C834,Sheet3!$A$1:$C$821,2,FALSE)","v":"Elementary Schools"},"Fire","YEAGERES","Houston, TX",81794,"1901-01-01",0,0,0,0,180,0,0,null,0]

{"sheet":"Avg. Costs","index":4,"n_rows":25,"n_cols":6,"rows_kept":25,"cut":false,"hidden":false,"merged":[]}
["Utility","(All)",null,null,"Utility","(All)"]
[]
["Row Labels","Sum of Cost","Cost/SF",null,"Row Labels","Average of Area"]
["Administration",2686228.4799999991,{"$f":"B4/F4","v":61.196403018892411},null,"Administration",43895.202127659577]
["Elementary Schools",5588888.2399999993,{"$f":"B5/F5","v":59.697620917924439},null,"Elementary Schools",93619.949238578687]
["High Schools",6055564.3600000031,{"$f":"B6/F6","v":11.380124168041055},null,"High Schools",532117.6]
["Middle Schools",3607370.6700000009,{"$f":"B7/F7","v":16.531268107142044},null,"Middle Schools",218215]
["Special Schools",318337.58999999997,{"$f":"B8/F8","v":6.3734821972002429},null,"Special Schools",49947.199999999997]
["Grand Total",18256389.340000004,null,null,"Grand Total",148219.06142506143]
[]
[]
[]
[]
[]
[]
[]
[]
[]
[]
[null,null,null,null,"Row Labels","Count of Area"]
[null,null,null,null,"Elementary Schools",56]
[null,null,null,null,"High Schools",12]
[null,null,null,null,"Middle Schools",18]
[null,null,null,null,"Special Schools",5]
[null,null,null,null,"Grand Total",91]

{"sheet":"Dashboard $","index":5,"n_rows":61,"n_cols":57,"rows_kept":61,"cut":false,"hidden":false,"merged":[[3,0,3,16],[15,8,15,9],[21,7,21,9],[24,0,24,2],[15,10,15,11],[14,7,14,11]]}
[]
[]
[]
["CFISD Energy Management Dept. Utilities (FY 2020-21)"]
[]
["School Type Sorted ","UTILITY COSTS","%","SQU FT","COST/ ft2"]
[{"$f":"INDEX($AR$10:$AR$14,MATCH(AX10,$AW$10:$AW$14,0))","v":"High Schools"},{"$f":"INDEX($AS$10:$AS$14,MATCH(AX10,$AW$10:$AW$14,0))","v":6055564.3600000031},{"$f":"B7/$B$12","v":0.331695625022013},{"$f":"INDEX($AV$10:$AV$14,MATCH(A7,$AU$10:$AU$14,0))/2","v":6518488},{"$f":"B7/D7","v":0.92898297273846375},null,null,null,null,null,null,null,null,null,null,null,null,null,null,null,null,null,null,null,null,null,null,null,null,null,null,null,null,null,null,null,null,null,null,null,null,null,null,"Utility","(All)",null,"Utility","(All)"]
[{"$f":"INDEX($AR$10:$AR$14,MATCH(AX11,$AW$10:$AW$14,0))","v":"Elementary Schools"},{"$f":"INDEX($AS$10:$AS$14,MATCH(AX11,$AW$10:$AW$14,0))","v":5588888.2399999993},{"$f":"B8/$B$12","v":0.3061332796973158},{"$f":"INDEX($AV$10:$AV$14,MATCH(A8,$AU$10:$AU$14,0))/2","v":5415387},{"$f":"B8/D8","v":1.0320385671421082},null,null,null,null,null,null,null,null,null,null,null,null,null,null,null,null,null,null,null,null,null,null,null,null,null,null,null,null,null,null,null,null,null,"Matt"]
[{"$f":"INDEX($AR$10:$AR$14,MATCH(AX12,$AW$10:$AW$14,0))","v":"Middle Schools"},{"$f":"INDEX($AS$10:$AS$14,MATCH(AX12,$AW$10:$AW$14,0))","v":3607370.6700000009},{"$f":"B9/$B$12","v":0.19759497182055011},{"$f":"INDEX($AV$10:$AV$14,MATCH(A9,$AU$10:$AU$14,0))/2","v":3968953},{"$f":"B9/D9","v":0.90889730112702294},null,null,null,null,null,null,null,null,null,null,null,null,null,null,null,null,null,null,null,null,null,null,null,null,null,null,null,null,null,null,null,null,null,{"$f":"AV10/12","v":208286.41666666666},{"$f":"#REF!","v":{"$error":"#REF!"}},{"$f":"AS10/12","v":223852.37333333326},null,null,"Row Labels","Sum of Cost",null,"Row Labels","Sum of Area"]
[{"$f":"INDEX($AR$10:$AR$14,MATCH(AX13,$AW$10:$AW$14,0))","v":"Administration"},{"$f":"INDEX($AS$10:$AS$14,MATCH(AX13,$AW$10:$AW$14,0))","v":2686228.4799999991},{"$f":"B10/$B$12","v":0.14713909086840771},{"$f":"INDEX($AV$10:$AV$14,MATCH(A10,$AU$10:$AU$14,0))/2","v":1249718.5},{"$f":"B10/D10","v":2.1494668439332529},null,null,null,null,null,null,null,null,null,null,null,null,null,null,null,null,null,null,null,null,null,null,null,null,null,null,null,null,null,null,null,null,null,{"$f":"AV11/18","v":601709.66666666663},{"$f":"#REF!","v":{"$error":"#REF!"}},{"$f":"AS11/18","v":310493.79111111106},null,null,"Administration",2686228.4799999991,null,"Administration",2499437,{"$f":"RANK(AS10,$AS$10:$AS$14,0)","v":4},1,{"$f":"AV10/2","v":1249718.5}]
[{"$f":"INDEX($AR$10:$AR$14,MATCH(AX14,$AW$10:$AW$14,0))","v":"Special Schools"},{"$f":"INDEX($AS$10:$AS$14,MATCH(AX14,$AW$10:$AW$14,0))","v":318337.58999999997},{"$f":"B11/$B$12","v":1.7437051215330696E-2},{"$f":"INDEX($AV$10:$AV$14,MATCH(A11,$AU$10:$AU$14,0))/2","v":296073},{"$f":"B11/D11","v":1.0751996635964778},null,null,null,null,null,null,null,null,null,null,null,null,null,null,null,null,null,null,null,null,null,null,null,null,null,null,null,null,null,null,null,null,null,{"$f":"AV12/56","v":232803.14285714287},{"$f":"#REF!","v":{"$error":"#REF!"}},{"$f":"AS12/56","v":108135.07785714291},null,null,"Elementary Schools",5588888.2399999993,null,"Elementary Schools",10830774,{"$f":"RANK(AS11,$AS$10:$AS$14,0)","v":2},2,5415387,null,null,null,null,"Utility","(All)"]
[{"$f":"\"% Expenses ( \"&ROUND(B12/AN23*100,1)&\"%)\"","v":"% Expenses ( 100%)"},{"$f":"ROUND(SUM(B7:B11),0)","v":18256389},null,{"$f":"IFERROR(SUM(D7:D11),\"\")","v":17448619.5},"Total Squ Ft.",null,null,null,null,null,null,null,null,null,null,null,null,null,null,null,null,null,null,null,null,null,null,null,null,null,null,null,null,null,null,null,null,null,{"$f":"AV13/4","v":1984476.5},{"$f":"#REF!","v":{"$error":"#REF!"}},{"$f":"AS13/4","v":901842.66750000021},null,null,"High Schools",6055564.3600000031,null,"High Schools",13036976,{"$f":"RANK(AS12,$AS$10:$AS$14,0)","v":1},3,6518488]
[null,null,null,null,null,null,null,null,null,null,null,null,null,null,null,null,null,null,null,null,null,null,null,null,null,null,null,null,null,null,null,null,null,null,null,null,null,null,null,null,null,null,null,"Middle Schools",3607370.6700000009,null,"Middle Schools",7937906,{"$f":"RANK(AS13,$AS$10:$AS$14,0)","v":3},4,3968953,null,null,null,null,"Row Labels","Sum of Cost"]
[null,null,null,null,null,null,null,null,null,null,null,null,null,null,null,null,null,null,null,null,null,null,null,null,null,null,null,null,null,null,null,null,null,null,null,null,null,null,null,null,null,null,null,"Special Schools",318337.58999999997,null,"Special Schools",592146,{"$f":"RANK(AS14,$AS$10:$AS$14,0)","v":5},5,296073,null,null,null,null,"Administration",2686228.4799999991]
[null,null,null,null,"Costs per Squ. ft.",null,null,"Consumption",null,null,null,null,null,null,null,null,null,null,null,null,null,null,null,null,null,null,null,null,null,null,null,null,null,null,null,null,null,null,null,null,null,null,null,"Grand Total",18256389.340000004,null,"Grand Total",34897239,null,null,17448619.5,null,null,null,null,"Elementary Schools",5588888.2399999993]
[null,null,null,null,"Total",{"$f":"AS15/AY15","v":1.0462941976584452},null,"Utility","Annual Usage",null,"Blended Rate",null,null,null,null,null,null,null,null,null,null,null,null,null,null,null,null,null,null,null,null,null,null,null,null,null,null,null,null,null,null,null,null,null,null,null,null,null,null,null,null,null,null,null,null,"High Schools",6055564.3600000031]
[null,null,null,null,"Schools Only",{"$f":"SUM(AS11:AS14)/SUM(AY11:AY14)","v":0.96118624714108714},null,"Electric",{"$f":"Benchmark!F12","v":185482186},"kWhs",{"$f":"AS29/I17","v":7.2228246274820163E-2},"Per kWh",null,null,null,null,null,null,null,null,null,null,null,null,null,null,null,null,null,null,null,null,null,null,null,null,null,null,"Utility","Costs",null,null,null,null,null,null,null,null,null,null,null,null,null,null,null,"Middle Schools",3607370.6700000009]
[null,null,null,null,null,null,null,"Water",{"$f":"water!B26*1000","v":449628000},"Gallons",{"$f":"(AS40+AS61)/(I18/1000)","v":8.8896151262821714},"Per kGal",null,null,null,null,null,null,null,null,null,null,null,null,null,null,null,null,null,null,null,null,null,null,null,null,null,null,"Electric",13397053.009999992,null,null,null,null,null,null,null,null,null,null,null,null,null,null,null,"Special Schools",318337.58999999997]
[null,null,null,null,null,null,null,"Natural Gas",{"$f":"Benchmark!F25*10","v":2183414.1740000001},"Therms",{"$f":"AS51/I19","v":0.38465266004085208},"Per Therm",null,null,null,null,null,null,null,null,null,null,null,null,null,null,null,null,null,null,null,null,null,null,null,null,null,null,"Fire",22460.39,null,null,null,null,null,null,null,null,null,null,null,null,null,null,null,"#N/A",6588.7]
[null,null,null,null,null,null,null,null,null,null,null,null,null,null,null,null,null,null,null,null,null,null,null,null,null,null,null,null,null,null,null,null,null,null,null,null,null,null,"Irrigation",705569.39999999979,null,null,null,"Electric Only",null,null,null,null,null,null,null,null,null,null,null,"Grand Total",18262978.040000003]
[null,null,null,null,null,null,null,null,null,null,null,null,null,null,null,null,null,null,null,null,null,null,null,null,null,null,null,null,null,null,null,null,null,null,null,null,null,null,"Nat_Gas",846444.77000000014,null,null,null,"Utility","Electric",null,"Utility","(All)"]
[null,null,null,null,null,null,null,"Energy Benchmarks",null,null,null,null,null,null,null,null,null,null,null,null,null,null,null,null,null,null,null,null,null,null,null,null,null,null,null,null,null,null,"Water",3291450.4700000011]
[null,null,null,null,null,null,null,"Benchmark","Schools Only","District",null,null,null,null,null,null,null,null,null,null,null,null,null,null,null,null,null,null,null,null,null,null,null,null,null,null,null,null,"Grand Total",18262978.039999995,null,null,null,"Row Labels","Sum of Cost",null,"Row Labels","Sum of Area"]
[null,null,null,null,null,null,null,"kWh/SF",{"$f":"Benchmark!G13","v":9.7968526815960608},{"$f":"Benchmark!G12","v":10.630192606354903},null,null,null,null,null,null,null,null,null,null,null,null,null,null,null,null,null,null,null,null,null,null,null,null,null,null,null,null,null,null,null,null,null,"Administration",1846183.1600000001,null,"Administration",2499437,4,1]
["Prepared by Jay Bonham, Energy Manager",null,null,null,null,null,null,"kBtus/SF",{"$f":"Benchmark!N30","v":44.354080658928652},{"$f":"Benchmark!K30","v":48.408207509482338},null,null,null,null,null,null,null,null,null,null,null,null,null,null,null,null,null,null,null,null,null,null,null,null,null,null,null,null,null,null,null,null,null,"Elementary Schools",4200388.3999999985,null,"Elementary Schools",10830774,2,2]
[null,null,null,null,null,null,null,null,null,null,null,null,null,null,null,null,null,null,null,null,null,null,null,null,null,null,null,null,null,null,null,null,null,null,null,null,null,null,null,null,null,null,null,"High Schools",4507837.03,null,"High Schools",13036976,1,3]
[null,null,null,null,null,null,null,null,null,null,null,null,null,null,null,null,null,null,null,null,null,null,null,null,null,null,null,null,null,null,null,null,null,null,null,null,null,null,null,null,null,null,null,"Middle Schools",2578059.9199999995,null,"Middle Schools",7937906,3,4]
[null,null,null,null,null,null,null,null,null,null,null,null,null,null,null,null,null,null,null,null,null,null,null,null,null,null,null,null,null,null,null,null,null,null,null,null,null,null,null,null,null,null,null,"Special Schools",264584.5,null,"Special Schools",592146,5,5]
[null,null,null,null,null,null,null,null,null,null,null,null,null,null,null,null,null,null,null,null,null,null,null,null,null,null,null,null,null,null,null,null,null,null,null,null,null,null,null,null,null,null,null,"Grand Total",13397053.01,null,"Grand Total",34897239]
[]
[null,null,null,null,null,null,null,null,null,null,null,null,null,null,null,null,null,null,null,null,null,null,null,null,null,null,null,null,null,null,null,null,null,null,null,null,null,null,null,null,null,null,null,"Water"]
[null,null,null,null,null,null,null,null,null,null,null,null,null,null,null,null,null,null,null,null,null,null,null,null,null,null,null,null,null,null,null,null,null,null,null,null,null,null,null,null,null,null,null,"Utility","Water",null,"Utility","(All)"]
[]
[null,null,null,null,null,null,null,null,null,null,null,null,null,null,null,null,null,null,null,null,null,null,null,null,null,null,null,null,null,null,null,null,null,null,null,null,null,null,null,null,null,null,null,"Row Labels","Sum of Cost",null,"Row Labels","Sum of Area"]
[null,null,null,null,null,null,null,null,null,null,null,null,null,null,null,null,null,null,null,null,null,null,null,null,null,null,null,null,null,null,null,null,null,null,null,null,null,null,null,null,null,null,null,"Administration",635915.75,null,"Administration",2499437,4,1]
[null,null,null,null,null,null,null,null,null,null,null,null,null,null,null,null,null,null,null,null,null,null,null,null,null,null,null,null,null,null,null,null,null,null,null,null,null,null,null,null,null,null,null,"Elementary Schools",1055833.1600000001,null,"Elementary Schools",10830774,2,2]
[null,null,null,null,null,null,null,null,null,null,null,null,null,null,null,null,null,null,null,null,null,null,null,null,null,null,null,null,null,null,null,null,null,null,null,null,null,null,null,null,null,null,null,"High Schools",925723.29,null,"High Schools",13036976,1,3]
[null,null,null,null,null,null,null,null,null,null,null,null,null,null,null,null,null,null,null,null,null,null,null,null,null,null,null,null,null,null,null,null,null,null,null,null,null,null,null,null,null,null,null,"Middle Schools",640978.09000000008,null,"Middle Schools",7937906,3,4]
[null,null,null,null,null,null,null,null,null,null,null,null,null,null,null,null,null,null,null,null,null,null,null,null,null,null,null,null,null,null,null,null,null,null,null,null,null,null,null,null,null,null,null,"Special Schools",33000.18,null,"Special Schools",592146,5,5]
[null,null,null,null,null,null,null,null,null,null,null,null,null,null,null,null,null,null,null,null,null,null,null,null,null,null,null,null,null,null,null,null,null,null,null,null,null,null,null,null,null,null,null,"Grand Total",{"$f":"SUM(AS35:AS39)","v":3291450.47},null,"Grand Total",34897239]
[]
[null,null,null,null,null,null,null,null,null,null,null,null,null,null,null,null,null,null,null,null,null,null,null,null,null,null,null,null,null,null,null,null,null,null,null,null,null,null,null,null,null,null,null,"Nat Gas"]
[null,null,null,null,null,null,null,null,null,null,null,null,null,null,null,null,null,null,null,null,null,null,null,null,null,null,null,null,null,null,null,null,null,null,null,null,null,null,null,null,null,null,null,"Utility","Nat_Gas",null,"Utility","(All)"]
[]
[null,null,null,null,null,null,null,null,null,null,null,null,null,null,null,null,null,null,null,null,null,null,null,null,null,null,null,null,null,null,null,null,null,null,null,null,null,null,null,null,null,null,null,"Row Labels","Sum of Cost",null,"Row Labels","Sum of Area"]
[null,null,null,null,null,null,null,null,null,null,null,null,null,null,null,null,null,null,null,null,null,null,null,null,null,null,null,null,null,null,null,null,null,null,null,null,null,null,null,null,null,null,null,"Administration",142126.38,null,"Administration",2499437,3,1]
[null,null,null,null,null,null,null,null,null,null,null,null,null,null,null,null,null,null,null,null,null,null,null,null,null,null,null,null,null,null,null,null,null,null,null,null,null,null,null,null,null,null,null,"Elementary Schools",198760.34999999992,null,"Elementary Schools",10830774,4,2]
[null,null,null,null,null,null,null,null,null,null,null,null,null,null,null,null,null,null,null,null,null,null,null,null,null,null,null,null,null,null,null,null,null,null,null,null,null,null,null,null,null,null,null,"High Schools",264984.33,null,"High Schools",13036976,1,3]
[null,null,null,null,null,null,null,null,null,null,null,null,null,null,null,null,null,null,null,null,null,null,null,null,null,null,null,null,null,null,null,null,null,null,null,null,null,null,null,null,null,null,null,"Middle Schools",214672.5,null,"Middle Schools",7937906,2,4]
[null,null,null,null,null,null,null,null,null,null,null,null,null,null,null,null,null,null,null,null,null,null,null,null,null,null,null,null,null,null,null,null,null,null,null,null,null,null,null,null,null,null,null,"Special Schools",19312.509999999998,null,"Special Schools",592146,5,5]
[null,null,null,null,null,null,null,null,null,null,null,null,null,null,null,null,null,null,null,null,null,null,null,null,null,null,null,null,null,null,null,null,null,null,null,null,null,null,null,null,null,null,null,"Grand Total",839856.07,null,"Grand Total",34897239]
[]
[null,null,null,null,null,null,null,null,null,null,null,null,null,null,null,null,null,null,null,null,null,null,null,null,null,null,null,null,null,null,null,null,null,null,null,null,null,null,null,null,null,null,null,"Utility","Irrigation",null,"Utility","(All)"]
[]
[null,null,null,null,null,null,null,null,null,null,null,null,null,null,null,null,null,null,null,null,null,null,null,null,null,null,null,null,null,null,null,null,null,null,null,null,null,null,null,null,null,null,null,"Row Labels","Sum of Cost",null,"Row Labels","Sum of Area"]
[null,null,null,null,null,null,null,null,null,null,null,null,null,null,null,null,null,null,null,null,null,null,null,null,null,null,null,null,null,null,null,null,null,null,null,null,null,null,null,null,null,null,null,"Administration",58384.95,null,"Administration",2499437,4,1]
[null,null,null,null,null,null,null,null,null,null,null,null,null,null,null,null,null,null,null,null,null,null,null,null,null,null,null,null,null,null,null,null,null,null,null,null,null,null,null,null,null,null,null,"Elementary Schools",128212.83000000002,null,"Elementary Schools",10830774,3,2]
[null,null,null,null,null,null,null,null,null,null,null,null,null,null,null,null,null,null,null,null,null,null,null,null,null,null,null,null,null,null,null,null,null,null,null,null,null,null,null,null,null,null,null,"High Schools",355260.26999999996,null,"High Schools",13036976,1,3]
[null,null,null,null,null,null,null,null,null,null,null,null,null,null,null,null,null,null,null,null,null,null,null,null,null,null,null,null,null,null,null,null,null,null,null,null,null,null,null,null,null,null,null,"Middle Schools",162270.95000000001,null,"Middle Schools",7937906,2,4]
[null,null,null,null,null,null,null,null,null,null,null,null,null,null,null,null,null,null,null,null,null,null,null,null,null,null,null,null,null,null,null,null,null,null,null,null,null,null,null,null,null,null,null,"Special Schools",1440.4,null,"Special Schools",592146,5,5]
[null,null,null,null,null,null,null,null,null,null,null,null,null,null,null,null,null,null,null,null,null,null,null,null,null,null,null,null,null,null,null,null,null,null,null,null,null,null,null,null,null,null,null,"Grand Total",{"$f":"SUM(AS56:AS60)","v":705569.4},null,"Grand Total",34897239]

{"sheet":"Benchmark","index":6,"n_rows":30,"n_cols":15,"rows_kept":30,"cut":false,"hidden":false,"merged":[]}
[]
[]
[]
[null,null,null,"Utility","Electric"]
[]
[null,null,null,"Row Labels","Sum of Area","Sum of kWhC","kWh/SF"]
[null,null,null,"Administration",2499437,26475641,{"$f":"F7/(E7/2)","v":21.185283725895072}]
[null,null,null,"Elementary Schools",10830774,54323729,{"$f":"F8/(E8/2)","v":10.031365994710997}]
[null,null,null,"High Schools",13036976,65028279,9.9759758704779387]
[null,null,null,"Middle Schools",7937906,36210138,9.1233476435724992]
[null,null,null,"Special Schools",592146,3444399,11.633614007356293]
[null,null,null,"Grand Total",34897239,185482186,{"$f":"SUMPRODUCT(G7:G11,E7:E11)/SUM(E7:E11)","v":10.630192606354903},"ALL"]
[null,null,null,null,null,null,{"$f":"SUMPRODUCT(F8:F10,G8:G10)/SUM(F8:F10)","v":9.7968526815960608},"Schools Only"]
[]
[]
[null,null,null,"Utility","Nat_Gas"]
[]
[null,null,null,"Row Labels","Sum of Area","Sum of kWhC"]
[null,null,null,"Administration",2318353,35743]
[null,null,null,"Elementary Schools",10666462,50247]
[null,null,null,"High Schools",11673918,70232]
[null,null,null,"Middle Schools",7929938,56507]
[null,null,null,"Special Schools",608029,4413]
[null,null,null,"#N/A",623683,1199.4174,null,null,null,null,"District",null,null,"School Only"]
[null,null,null,"Grand Total",33820383,218341.41740000001,null,null,null,null,"Combined Electric & Gas (kBtus)",null,null,"Combined Electric & Gas (kBtus)"]
[null,null,null,null,null,{"$f":"(F25*1000)/(E25/2)","v":12.911824055925091},"kBTU/ft2",null,null,null,{"$f":"(F25*10*100000/1000)*0.97","v":211791174.87799999},"Gas",null,{"$f":"(SUM(F20:F23)*10*100000/1000)*0.97","v":175957030},"Gas"]
[null,null,null,null,null,null,null,null,null,null,{"$f":"F12*3.412","v":632865218.63199997},"kWh",null,{"$f":"SUM(F8:F11)*3.412","v":542530331.53999996},"Electric"]
[null,null,null,null,null,null,null,null,null,null,{"$f":"SUM(K26:K27)","v":844656393.50999999},"TOTAL",null,{"$f":"SUM(N26:N27)","v":718487361.53999996},"TOTAL"]
[null,null,null,null,null,null,null,null,null,null,{"$f":"E12/2","v":17448619.5},"Area",null,{"$f":"SUM(E8:E11)/2","v":16198901},"Area"]
[null,null,null,null,null,null,null,null,null,null,{"$f":"K28/K29","v":48.408207509482338},null,null,{"$f":"N28/N29","v":44.354080658928652}]

{"sheet":"water","index":7,"n_rows":26,"n_cols":5,"rows_kept":26,"cut":false,"hidden":false,"merged":[]}
["Location:"]
["Time:",null,"Commodity:","Water","Created By:"]
["Year","Use (KGAL)"]
[2019,338486]
[2020,320067]
[2021,345153]
[]
[]
["Location:"]
["Time:",null,"Commodity:","Irrigation","Created By:"]
["Year","Use (KGAL)"]
[2019,90056]
[2020,125084]
[2021,104099]
[]
[]
["Location:"]
["Time:",null,"Commodity:","Fire Protection","Created By:"]
["Year","Use (KGAL)"]
[2019,198]
[2020,356]
[2021,376]
[]
[]
[null,"Total Water"]
[null,{"$f":"B6+B14+B22","v":449628},"KGAL"]

{"sheet":"Electric Matt","index":8,"n_rows":31,"n_cols":18,"rows_kept":31,"cut":false,"hidden":false,"merged":[]}
[]
[]
[null,null,null,"Average","Average"]
[null,null,"Avg.","Annual","Annual"]
[null,null,"Sq Feet","Cost/Sq.Ft.","Cost",null,null,null,null,null,null,null,null,"School Type Sorted ","COSTS","%","SQU FT","COST/ ft2"]
[null,"High School",{"$f":"'Dashboard $'!AV26/2/12","v":543207.33333333337},{"$f":"O6/Q6","v":0.69154641843323184},{"$f":"O6/M6","v":375653.08583333337},null,null,null,null,null,null,null,12,"High Schools",{"$f":"O18","v":4507837.03},{"$f":"P18","v":0.33647974894180088},6518488,0.69154641843323184]
[null,"Middle School",{"$f":"'Dashboard $'!AV27/2/18","v":220497.38888888888},{"$f":"O7/Q7","v":0.64955667653408833},{"$f":"O7/M7","v":143225.55111111107},null,null,null,null,null,null,null,18,"Middle Schools",{"$f":"O19","v":2578059.9199999995},0.19243485265005666,3968953,0.64955667653408833]
[null,"Elementary School",{"$f":"'Dashboard $'!AV25/2/57","v":95006.789473684214},{"$f":"O8/Q8","v":0.77563956186326088},{"$f":"O8/M8","v":75006.93571428569},null,null,null,null,null,null,null,56,"Elementary Schools",{"$f":"O20","v":4200388.3999999985},0.31353077426804227,5415387,0.77563956186326088]
[null,"Special School",{"$f":"'ALL Matt'!C9/2/5","v":5921.46},{"$f":"O9/Q9","v":0.89364616158852717},{"$f":"O9/M9","v":52916.9},null,null,null,null,null,null,null,5,"Special Schools",{"$f":"O21","v":264584.5},1.9749455346634817E-2,296073,0.89364616158852717]
[null,null,"Wt. Avg.",{"$f":"SUMPRODUCT(C6:C9,D6:D9)/SUM(C6:C9)","v":0.69146258710582365}]
[]
[]
[]
[]
[]
[]
[null,null,null,null,null,null,null,null,null,null,null,null,null,"School Type Sorted ","UTILITY COSTS","%","SQU FT","COST/ ft2"]
[null,null,null,null,null,null,null,null,null,null,null,null,null,"High Schools",4507837.03,0.33647974894180088,6518488,0.69154641843323184]
[null,null,null,null,null,null,null,null,null,null,null,null,null,"Middle Schools",2578059.9199999995,0.19243485265005666,3968953,0.64955667653408833]
[null,null,null,null,null,null,null,null,null,null,null,null,null,"Elementary Schools",4200388.3999999985,0.31353077426804227,5415387,0.77563956186326088]
[null,null,null,null,null,null,null,null,null,null,null,null,null,"Special Schools",264584.5,1.9749455346634817E-2,296073,0.89364616158852717]
[]
[]
[]
[null,null,null,null,null,null,null,null,null,null,null,null,null,"School Type Sorted ","UTILITY COSTS","%","SQU FT","COST/ ft2"]
[null,null,null,null,null,null,null,null,null,null,null,null,null,"High Schools",4507837.03,0.33647974894180088,6518488,0.69154641843323184]
[null,null,null,null,null,null,null,null,null,null,null,null,null,"Elementary Schools",4200388.3999999985,0.31353077426804227,5415387,0.77563956186326088]
[null,null,null,null,null,null,null,null,null,null,null,null,null,"Middle Schools",2578059.9199999995,0.19243485265005666,3968953,0.64955667653408833]
[null,null,null,null,null,null,null,null,null,null,null,null,null,"Administration",1846183.1600000001,0.13780516953989808,1249718.5,1.4772792112783799]
[null,null,null,null,null,null,null,null,null,null,null,null,null,"Special Schools",264584.5,1.9749455346634817E-2,296073,0.89364616158852717]
[null,null,null,null,null,null,null,null,null,null,null,null,null,"% Expenses ( 73.4%)",13397053,null,17448619.5,"Total Squ Ft."]

{"sheet":"Gas Matt","index":9,"n_rows":21,"n_cols":16,"rows_kept":21,"cut":false,"hidden":false,"merged":[]}
[]
[]
[null,null,null,"Average","Average"]
[null,null,"Avg.","Annual","Annual"]
[null,null,"Sq Feet","Cost/Sq.Ft.","Cost",null,null,null,null,null,null,"School Type Sorted ","COSTS","%","SQU FT","COST/ ft2"]
[null,"High School",{"$f":"'Electric Matt'!C6","v":543207.33333333337},{"$f":"E6/C6","v":4.0651195491960709E-2},{"$f":"M6/K6","v":22082.0275},null,null,null,null,null,12,"High Schools",{"$f":"M18","v":264984.33},{"$f":"N18","v":0.31551162342115791},6518488,4.0651195491960716E-2]
[null,"Middle School",{"$f":"'Electric Matt'!C7","v":220497.38888888888},{"$f":"E7/C7","v":5.1241208290554473E-2},{"$f":"M7/K7","v":11298.552631578947},null,null,null,null,null,19,"Middle Schools",{"$f":"M19","v":214672.5},0.25560631822598162,3968953,5.4087942084474171E-2]
[null,"Elementary School",{"$f":"'Electric Matt'!C8","v":95006.789473684214},{"$f":"E8/C8","v":3.7358298116881697E-2},{"$f":"M8/K8","v":3549.2919642857128},null,null,null,null,null,56,"Elementary Schools",{"$f":"M20","v":198760.34999999992},0.23666003457735602,5415387,3.6702889377989038E-2]
[null,"Special School",{"$f":"'ALL Matt'!C9","v":59214.6},{"$f":"E9/C9","v":6.5228879364210846E-2},{"$f":"M9/K9","v":3862.5019999999995},null,null,null,null,null,5,"Special Schools",{"$f":"M21","v":19312.509999999998},2.2995025337676934E-2,296073,6.5228879364210846E-2]
[null,null,"Wt. Avg.",{"$f":"SUMPRODUCT(C6:C9,D6:D9)/SUM(C6:C9)","v":4.4439714238544821E-2},null,null,null,null,null,null,null,null,{"$f":"SUM(M6:M9)","v":697729.69}]
[]
[]
[]
[]
[]
[]
[null,null,null,null,null,null,null,null,null,null,null,"School Type Sorted ","UTILITY COSTS","%","SQU FT","COST/ ft2"]
[null,null,null,null,null,null,null,null,null,null,null,"High Schools",264984.33,0.31551162342115791,6518488,4.0651195491960716E-2]
[null,null,null,null,null,null,null,null,null,null,null,"Middle Schools",214672.5,0.25560631822598162,3968953,5.4087942084474171E-2]
[null,null,null,null,null,null,null,null,null,null,null,"Elementary Schools",198760.34999999992,0.23666003457735602,5415387,3.6702889377989038E-2]
[null,null,null,null,null,null,null,null,null,null,null,"Special Schools",19312.509999999998,2.2995025337676934E-2,296073,6.5228879364210846E-2]

{"sheet":"Water Matt","index":10,"n_rows":30,"n_cols":18,"rows_kept":30,"cut":false,"hidden":false,"merged":[]}
[]
[]
[null,null,null,"Average","Average"]
[null,null,"Avg.","Annual","Annual"]
[null,null,"Sq Feet","Cost/Sq.Ft.","Cost",null,null,null,null,null,null,null,null,"School Type Sorted ","COSTS","%","SQU FT","COST/ ft2"]
[null,"High School",{"$f":"'Electric Matt'!C6","v":543207.33333333337},{"$f":"E6/C6","v":0.19678535881327081},{"$f":"O6/M6","v":106895.25},null,null,null,null,null,null,null,12,"High Schools",{"$f":"O16+O22+O28","v":1282743},null,{"$f":"Q16","v":6518488},{"$f":"O6/Q6","v":0.19678535881327081}]
[null,"Middle School",{"$f":"'Electric Matt'!C7","v":220497.38888888888},{"$f":"E7/C7","v":0.1944499097448569},{"$f":"O7/M7","v":42875.697368421053},null,null,null,null,null,null,null,19,"Middle Schools",{"$f":"O17+O23+O29","v":814638.25},null,{"$f":"Q17","v":3968953},{"$f":"O7/Q7","v":0.20525268250846004}]
[null,"Elementary School",{"$f":"'Electric Matt'!C8","v":95006.789473684214},{"$f":"E8/C8","v":0.22361926082765915},{"$f":"O8/M8","v":21245.348035714291},null,null,null,null,null,null,null,56,"Elementary Schools",1189739.4900000002,null,5415387,0.21969611590085811]
[null,"Special School",{"$f":"'ALL Matt'!C9","v":59214.6},{"$f":"E9/C9","v":0.1163246226437399},{"$f":"O9/M9","v":6888.116},null,null,null,null,null,null,null,5,"Special Schools",34440.58,null,296073,{"$f":"O9/Q9","v":0.1163246226437399}]
[null,null,"Wt. Avg.",{"$f":"SUMPRODUCT(C6:C9,D6:D9)/SUM(C6:C9)","v":0.19381125467217575},null,null,null,null,null,null,null,null,null,null,null,null,{"$f":"SUM(Q6:Q9)","v":16198901}]
[]
[]
[]
[]
[]
[null,null,null,null,null,null,null,null,null,null,null,null,"W","High Schools",925723.29,0.28125090461650643,6518488,0.14201503324083745]
[null,null,null,null,null,null,null,null,null,null,null,null,null,"Middle Schools",640978.09000000008,0.19474033936411006,3968953,0.16149802983305675]
[null,null,null,null,null,null,null,null,null,null,null,null,null,"Elementary Schools",1055833.1600000001,0.3207805556821462,5415387,0.19496910562439954]
[null,null,null,null,null,null,null,null,null,null,null,null,null,"Special Schools",33000.18,1.0026031080526819E-2,296073,0.11145960624575696]
[]
[]
[null,null,null,null,null,null,null,null,null,null,null,null,"I","High Schools",355260.26999999996,0.50350889849185543,6518488,5.4500410217829649E-2]
[null,null,null,null,null,null,null,null,null,null,null,null,null,"Middle Schools",162270.95000000001,0.2299859404253872,3968953,4.0885077248332242E-2]
[null,null,null,null,null,null,null,null,null,null,null,null,null,"Elementary Schools",128212.83000000002,0.18171550904305606,5415387,2.3675654205322725E-2]
[null,null,null,null,null,null,null,null,null,null,null,null,null,"Special Schools",1440.4,2.0414729105161936E-3,296073,4.8650163979829303E-3]
[]
[]
[null,null,null,null,null,null,null,null,null,null,null,null,"F","High Schools",1759.44,3.9167427261191871E-2,6518488,2.6991535460370563E-4]
[null,null,null,null,null,null,null,null,null,null,null,null,null,"Middle Schools",11389.21,0.25353865675296627,3968953,2.8695754270710687E-3]
[null,null,null,null,null,null,null,null,null,null,null,null,null,"Elementary Schools",5693.5,0.12674472963647293,5415387,1.051356071135821E-3]

{"sheet":"ALL Matt","index":11,"n_rows":27,"n_cols":18,"rows_kept":27,"cut":false,"hidden":false,"merged":[]}
[]
[]
[null,null,null,"Average","Average"]
[null,null,"Avg.","Annual","Annual"]
[null,null,"Sq Feet","Cost/Sq.Ft.","Cost",null,null,null,null,null,null,null,null,"School Type Sorted ","COSTS","%","SQU FT","COST/ ft2"]
[null,"High School",{"$f":"'Electric Matt'!C6","v":543207.33333333337},{"$f":"E6/C6","v":0.92898297273846364},{"$f":"O6/M6","v":504630.36333333357},null,null,null,null,null,null,null,12,"High Schools",{"$f":"O17","v":6055564.3600000031},{"$f":"P17","v":0.331695625022013},6518488,0.92898297273846375]
[null,"Middle School",{"$f":"'Electric Matt'!C7","v":220497.38888888888},{"$f":"E7/C7","v":0.86106060106770599},{"$f":"O7/M7","v":189861.61421052637},null,null,null,null,null,null,null,19,"Middle Schools",{"$f":"O18","v":3607370.6700000009},0.19759497182055011,3968953,0.90889730112702294]
[null,"Elementary School",{"$f":"'Electric Matt'!C8","v":95006.789473684214},{"$f":"E8/C8","v":1.0504678272696457},{"$f":"O8/M8","v":99801.575714285704},null,null,null,null,null,null,null,56,"Elementary Schools",{"$f":"O19","v":5588888.2399999993},0.3061332796973158,5415387,1.0320385671421082]
[null,"Special School",{"$f":"Q9/M9","v":59214.6},{"$f":"E9/C9","v":1.0751996635964778},{"$f":"O9/M9","v":63667.517999999996},null,null,null,null,null,null,null,5,"Special Schools",{"$f":"O20","v":318337.58999999997},1.7437051215330696E-2,296073,1.0751996635964778]
[null,null,"Wt. Avg.",{"$f":"SUMPRODUCT(C6:C9,D6:D9)/SUM(C6:C9)","v":0.9346733471532116}]
[]
[]
[]
[]
[]
[]
[null,null,null,null,null,null,null,null,null,null,null,null,null,"High Schools",6055564.3600000031,0.331695625022013,6518488,0.92898297273846375]
[null,null,null,null,null,null,null,null,null,null,null,null,null,"Middle Schools",3607370.6700000009,0.19759497182055011,3968953,0.90889730112702294]
[null,null,null,null,null,null,null,null,null,null,null,null,null,"Elementary Schools",5588888.2399999993,0.3061332796973158,5415387,1.0320385671421082]
[null,null,null,null,null,null,null,null,null,null,null,null,null,"Special Schools",318337.58999999997,1.7437051215330696E-2,296073,1.0751996635964778]
[]
[]
[null,null,null,null,null,null,null,null,null,null,null,null,null,"High Schools",6055564.3600000031,0.331695625022013,6518488,0.92898297273846375]
[null,null,null,null,null,null,null,null,null,null,null,null,null,"Middle Schools",3607370.6700000009,0.19759497182055011,3968953,0.90889730112702294]
[null,null,null,null,null,null,null,null,null,null,null,null,null,"Elementary Schools",5588888.2399999993,0.3061332796973158,5415387,1.0320385671421082]
[null,null,null,null,null,null,null,null,null,null,null,null,null,"Special Schools",318337.58999999997,1.7437051215330696E-2,296073,1.0751996635964778]
[null,null,null,null,null,null,null,null,null,null,null,null,null,"Administration",2686228.4799999991,0.14713909086840771,1249718.5,2.1494668439332529]

{"sheet":"%","index":12,"n_rows":42,"n_cols":10,"rows_kept":42,"cut":false,"hidden":false,"merged":[]}
[]
[]
[]
[null,null,null,"Utility","Electric"]
[]
[null,null,null,"Row Labels","Sum of Area","Sum of Mmbtus","kWh/SF"]
[null,null,null,"Administration",2499437,26475641,{"$f":"ROUND((F7/E7*1000000)/3412,1)*2","v":6209}]
[null,null,null,"Elementary Schools",10830774,54323729,{"$f":"ROUND((F8/E8*1000000)/3412,1)*2","v":2940}]
[null,null,null,"High Schools",13036976,65028279,{"$f":"ROUND((F9/E9*1000000)/3412,1)*2","v":2923.8}]
[null,null,null,"Middle Schools",7937906,36210138,{"$f":"ROUND((F10/E10*1000000)/3412,1)*2","v":2674}]
[null,null,null,"Special Schools",592146,3444399,{"$f":"ROUND((F11/E11*1000000)/3412,1)*2","v":3409.6}]
[null,null,null,"Grand Total",34897239,185482186,{"$f":"SUMPRODUCT(G7:G11,E7:E11)/SUM(E7:E11)","v":3115.5453864817218},"ALL"]
[null,null,null,null,null,null,{"$f":"SUMPRODUCT(F8:F10,G8:G10)/SUM(F8:F10)","v":2871.3113433919843},"Schools Only"]
[]
[]
[null,null,null,"Utility","(Multiple Items)"]
[]
[null,null,null,"Row Labels","Sum of Area","Sum of Mmbtus"]
[null,null,null,"Elementary Schools",21497236,54373976]
[null,null,null,"High Schools",24710894,65098511]
[null,null,null,"Middle Schools",15867844,36266645]
[null,null,null,"Grand Total",62075974,155739132]
[]
[null,null,null,null,null,"kBtus/SF",null,null,"kbtus"]
[null,null,null,null,null,"Schools Only",null,"ALL",41.24]
[null,null,null,null,null,{"$f":"(F22*1000)/((SUM(E8:E10)/2))","v":9793.1721326546449},null,"Electric",33.03,{"$f":"I26/I25","v":0.800921435499515}]
[null,null,null,null,null,null,null,"Gas",{"$f":"I25-I26","v":8.2100000000000009},{"$f":"I27/I25","v":0.19907856450048497}]
[]
[]
[null,null,null,"Utility","(Multiple Items)"]
[]
[null,null,null,"Row Labels","Sum of Area","Sum of Mmbtus"]
[null,null,null,"Administration",4817790,26511384]
[null,null,null,"Elementary Schools",21497236,54373976]
[null,null,null,"High Schools",24710894,65098511]
[null,null,null,"Middle Schools",15867844,36266645]
[null,null,null,"Special Schools",1200175,3448812]
[null,null,null,"#N/A",623683,1199.4174]
[null,null,null,"Grand Total",68717622,185700527.4174]
[null,null,null,null,null,"kBtus/SF"]
[null,null,null,null,null,"ALL"]
[null,null,null,null,null,{"$f":"F38*1000/(E12/2)","v":6.8739959628324757E-2}]