{"text_format":"1","workbook":"xlsx","n_sheets":13,"sheets":["Utility Pie","Sheet3","Sheet1","DataYY03","Avg. Costs","Dashboard $","Benchmark","water","Electric Matt","Gas Matt","Water Matt","ALL Matt","%"],"not_rendered":{"charts":4,"images":1,"macros":1,"external_links":0,"defined_names":11,"comments":1,"pivot_tables":13},"unopened":[],"bounds":{"document_bytes":16777216,"sheet_cells":100000,"rows_first":2000,"rows_last":500,"rows_between":2000,"halvings":0,"cell_chars":16384,"cell_head_chars":4096},"cells_cut":0,"cells_raw":0,"read":"whole","date_system":"1900"}

{"sheet":"Utility Pie","index":0,"n_rows":0,"n_cols":0,"rows_kept":0,"cut":false,"hidden":false,"merged":[]}

{"sheet":"Sheet3","index":1,"n_rows":821,"n_cols":3,"rows_kept":821,"cut":false,"hidden":false,"merged":[]}
["ALCABC","Special Schools","Electric"]
["ALCWEST","Special Schools","Electric"]
["ANDREES","Elementary Schools","Electric"]
["ANTHONYMS","Middle Schools","Electric"]
["ARAGONMS","Middle Schools","Electric"]
["ARNOLDMS","Middle Schools","Electric"]
["AULTES","Elementary Schools","Electric"]
["BANEES","Elementary Schools","Electric"]
["BANGES","Elementary Schools","Electric"]
["BARKERTRANS","Administration","Electric"]
["BERRYCENTER","Administration","Electric"]
["BIRKESES","Elementary Schools","Electric"]
["BLACKES","Elementary Schools","Electric"]
["BLEYLMS","Middle Schools","Electric"]
["BRADLEYPOLICESTATION","Administration","Electric"]
{"$rows_left_out":807}
{"sheet":"Sheet1","index":2,"n_rows":17,"n_cols":2,"rows_kept":17,"cut":false,"hidden":false,"merged":[]}
["School Type","High Schools"]
[]
["Row Labels"]
["BRIDGELANDHS"]
["CY-CREEKHS"]
["CY-FAIRHS"]
["CY-FALLSAGVOC"]
["CY-FALLSHS"]
["CY-LAKESHS"]
["CY-PARKHS"]
["CY-RANCHHS"]
["CY-RIDGEHS"]
["CY-SPRINGSHS"]
["CY-WOODSHS"]
["JERSEYVILLAGEHS"]
{"$rows_left_out":3}
{"sheet":"DataYY03","index":3,"n_rows":834,"n_cols":15,"rows_kept":834,"cut":false,"hidden":false,"merged":[]}
["School Type","Utility","Place","Location","Area","Eff. Date","kWhB","kWhC","Var [%]","Base Year 2","Cost","Var [%]3","Base Year 4","Current Year5","Var [%]6"]
[{"$f":"VLOOKUP(C2,Sheet3!$A$1:$C$821,2,FALSE)","v":"Elementary Schools"},"Electric","ADAM-ES","Houston, TX",103177,367,586800,603360,2.8220858895705501,44139.93,44980.85,1.9051230937611401,3211,2800,-12.799750856431]
[{"$f":"VLOOKUP(C3,Sheet3!$A$1:$C$821,2,FALSE)","v":"Special Schools"},"Electric","ALCABC","Houston, TX",56061,367,377472,367296,-2.6958290946083401,28698.65,26960.080000000002,-6.0580201507736398,2138,1641,-23.246024321796099]
[{"$f":"VLOOKUP(C4,Sheet3!$A$1:$C$821,2,FALSE)","v":"Special Schools"},"Electric","ALCWEST","Katy, TX",50839,367,276096,284352,2.99026425591099,20246.689999999999,19725.98,-2.5718277901227302,1396,1107,-20.702005730659]
[{"$f":"VLOOKUP(C5,Sheet3!$A$1:$C$821,2,FALSE)","v":"Elementary Schools"},"Electric","ANDREES","Cypress, TX",100156,43952,614784,585024,-4.8407245471580298,44097.53,42464.25,-3.70379021228627,2962,2562,-13.5043889264011]
[{"$f":"VLOOKUP(C6,Sheet3!$A$1:$C$821,2,FALSE)","v":"Middle Schools"},"Electric","ANTHONYMS","Cypress, TX",244123,367,1159110,1057285,-8.78475727066456,80346.559999999998,72921.05,-9.2418517980110195,6192,4563,-26.308139534883701]
[{"$f":"VLOOKUP(C7,Sheet3!$A$1:$C$821,2,FALSE)","v":"Middle Schools"},"Electric","ARAGONMS","Houston, TX",219821,367,1227534,1177837,-4.0485232995583003,82742.960000000006,88407.44,6.8458754678343601,5245,5239,-0.11439466158245901]
[{"$f":"VLOOKUP(C8,Sheet3!$A$1:$C$821,2,FALSE)","v":"Middle Schools"},"Electric","ARNOLDMS","Cypress, TX",210699,44409,1191084,1196777,0.477967968673914,71842.710000000006,71437.399999999994,-0.56416301667907598,3114,2921,-6.1978163134232496]
[{"$f":"VLOOKUP(C9,Sheet3!$A$1:$C$821,2,FALSE)","v":"Elementary Schools"},"Electric","AULTES","Cypress, TX",91912,43952,316416,314496,-0.60679611650485399,23266.2,23244.959999999999,-9.12912293369781E-2,1540,1420,-7.7922077922077904]
[{"$f":"VLOOKUP(C10,Sheet3!$A$1:$C$821,2,FALSE)","v":"Elementary Schools"},"Electric","BANEES","Houston, TX",106804,367,557568,552576,-0.895316804407714,42653.63,42195.91,-1.0731091351427799,2987,2597,-13.056578506863101]
[{"$f":"VLOOKUP(C11,Sheet3!$A$1:$C$821,2,FALSE)","v":"Elementary Schools"},"Electric","BANGES","Houston, TX",89313,44044,403488,423936,5.0678087080656704,29425.17,30746.36,4.4899995480060104,1875,1851,-1.28]
[{"$f":"VLOOKUP(C12,Sheet3!$A$1:$C$821,2,FALSE)","v":"Administration"},"Electric","BARKERTRANS","Houston, TX",22677,367,180480,177312,-1.7553191489361699,11490.05,11940.47,3.9200873799504801,650,645,-0.76923076923076905]
[{"$f":"VLOOKUP(C13,Sheet3!$A$1:$C$821,2,FALSE)","v":"Administration"},"Electric","BERRYCENTER","Cypress, TX",491434,367,2786626,2411171,-13.4734621725341,180277.45,172961,-4.0584388119534598,9574,9049,-5.4836014205138897]
[{"$f":"VLOOKUP(C14,Sheet3!$A$1:$C$821,2,FALSE)","v":"Elementary Schools"},"Electric","BIRKESES","Houston, TX",104952,44044,632640,749568,18.4825493171472,45891.69,53699.46,17.013472373756599,3200,3186,-0.4375]
[{"$f":"VLOOKUP(C15,Sheet3!$A$1:$C$821,2,FALSE)","v":"Elementary Schools"},"Electric","BLACKES","Cypress, TX",101992,44409,472320,513216,8.6585365853658498,36228.04,38611.4,6.5787715813496996,2668,2413,-9.5577211394302903]
{"$rows_left_out":820}
{"sheet":"Avg. Costs","index":4,"n_rows":25,"n_cols":6,"rows_kept":25,"cut":false,"hidden":false,"merged":[]}
["Utility","(All)",null,null,"Utility","(All)"]
[]
["Row Labels","Sum of Cost","Cost/SF",null,"Row Labels","Average of Area"]
["Administration",2686228.4799999991,{"$f":"B4/F4","v":61.196403018892411},null,"Administration",43895.202127659577]
["Elementary Schools",5588888.2399999993,{"$f":"B5/F5","v":59.697620917924439},null,"Elementary Schools",93619.949238578687]
["High Schools",6055564.3600000031,{"$f":"B6/F6","v":11.380124168041055},null,"High Schools",532117.6]
["Middle Schools",3607370.6700000009,{"$f":"B7/F7","v":16.531268107142044},null,"Middle Schools",218215]
["Special Schools",318337.58999999997,{"$f":"B8/F8","v":6.3734821972002429},null,"Special Schools",49947.199999999997]
["Grand Total",18256389.340000004,null,null,"Grand Total",148219.06142506143]
[]
[]
[]
[]
[]
[]
{"$rows_left_out":11}
{"sheet":"Dashboard $","index":5,"n_rows":61,"n_cols":57,"rows_kept":61,"cut":false,"hidden":false,"merged":[[3,0,3,16],[15,8,15,9],[21,7,21,9],[24,0,24,2],[15,10,15,11],[14,7,14,11]]}
[]
[]
[]
["CFISD Energy Management Dept. Utilities (FY 2020-21)"]
[]
["School Type Sorted ","UTILITY COSTS","%","SQU FT","COST/ ft2"]
[{"$f":"INDEX($AR$10:$AR$14,MATCH(AX10,$AW$10:$AW$14,0))","v":"High Schools"},{"$f":"INDEX($AS$10:$AS$14,MATCH(AX10,$AW$10:$AW$14,0))","v":6055564.3600000031},{"$f":"B7/$B$12","v":0.331695625022013},{"$f":"INDEX($AV$10:$AV$14,MATCH(A7,$AU$10:$AU$14,0))/2","v":6518488},{"$f":"B7/D7","v":0.92898297273846375},null,null,null,null,null,null,null,null,null,null,null,null,null,null,null,null,null,null,null,null,null,null,null,null,null,null,null,null,null,null,null,null,null,null,null,null,null,null,"Utility","(All)",null,"Utility","(All)"]
[{"$f":"INDEX($AR$10:$AR$14,MATCH(AX11,$AW$10:$AW$14,0))","v":"Elementary Schools"},{"$f":"INDEX($AS$10:$AS$14,MATCH(AX11,$AW$10:$AW$14,0))","v":5588888.2399999993},{"$f":"B8/$B$12","v":0.3061332796973158},{"$f":"INDEX($AV$10:$AV$14,MATCH(A8,$AU$10:$AU$14,0))/2","v":5415387},{"$f":"B8/D8","v":1.0320385671421082},null,null,null,null,null,null,null,null,null,null,null,null,null,null,null,null,null,null,null,null,null,null,null,null,null,null,null,null,null,null,null,null,null,"Matt"]
[{"$f":"INDEX($AR$10:$AR$14,MATCH(AX12,$AW$10:$AW$14,0))","v":"Middle Schools"},{"$f":"INDEX($AS$10:$AS$14,MATCH(AX12,$AW$10:$AW$14,0))","v":3607370.6700000009},{"$f":"B9/$B$12","v":0.19759497182055011},{"$f":"INDEX($AV$10:$AV$14,MATCH(A9,$AU$10:$AU$14,0))/2","v":3968953},{"$f":"B9/D9","v":0.90889730112702294},null,null,null,null,null,null,null,null,null,null,null,null,null,null,null,null,null,null,null,null,null,null,null,null,null,null,null,null,null,null,null,null,null,{"$f":"AV10/12","v":208286.41666666666},{"$f":"#REF!","v":{"$error":"#REF!"}},{"$f":"AS10/12","v":223852.37333333326},null,null,"Row Labels","Sum of Cost",null,"Row Labels","Sum of Area"]
[{"$f":"INDEX($AR$10:$AR$14,MATCH(AX13,$AW$10:$AW$14,0))","v":"Administration"},{"$f":"INDEX($AS$10:$AS$14,MATCH(AX13,$AW$10:$AW$14,0))","v":2686228.4799999991},{"$f":"B10/$B$12","v":0.14713909086840771},{"$f":"INDEX($AV$10:$AV$14,MATCH(A10,$AU$10:$AU$14,0))/2","v":1249718.5},{"$f":"B10/D10","v":2.1494668439332529},null,null,null,null,null,null,null,null,null,null,null,null,null,null,null,null,null,null,null,null,null,null,null,null,null,null,null,null,null,null,null,null,null,{"$f":"AV11/18","v":601709.66666666663},{"$f":"#REF!","v":{"$error":"#REF!"}},{"$f":"AS11/18","v":310493.79111111106},null,null,"Administration",2686228.4799999991,null,"Administration",2499437,{"$f":"RANK(AS10,$AS$10:$AS$14,0)","v":4},1,{"$f":"AV10/2","v":1249718.5}]
[{"$f":"INDEX($AR$10:$AR$14,MATCH(AX14,$AW$10:$AW$14,0))","v":"Special Schools"},{"$f":"INDEX($AS$10:$AS$14,MATCH(AX14,$AW$10:$AW$14,0))","v":318337.58999999997},{"$f":"B11/$B$12","v":1.7437051215330696E-2},{"$f":"INDEX($AV$10:$AV$14,MATCH(A11,$AU$10:$AU$14,0))/2","v":296073},{"$f":"B11/D11","v":1.0751996635964778},null,null,null,null,null,null,null,null,null,null,null,null,null,null,null,null,null,null,null,null,null,null,null,null,null,null,null,null,null,null,null,null,null,{"$f":"AV12/56","v":232803.14285714287},{"$f":"#REF!","v":{"$error":"#REF!"}},{"$f":"AS12/56","v":108135.07785714291},null,null,"Elementary Schools",5588888.2399999993,null,"Elementary Schools",10830774,{"$f":"RANK(AS11,$AS$10:$AS$14,0)","v":2},2,5415387,null,null,null,null,"Utility","(All)"]
[{"$f":"\"% Expenses ( \"&ROUND(B12/AN23*100,1)&\"%)\"","v":"% Expenses ( 100%)"},{"$f":"ROUND(SUM(B7:B11),0)","v":18256389},null,{"$f":"IFERROR(SUM(D7:D11),\"\")","v":17448619.5},"Total Squ Ft.",null,null,null,null,null,null,null,null,null,null,null,null,null,null,null,null,null,null,null,null,null,null,null,null,null,null,null,null,null,null,null,null,null,{"$f":"AV13/4","v":1984476.5},{"$f":"#REF!","v":{"$error":"#REF!"}},{"$f":"AS13/4","v":901842.66750000021},null,null,"High Schools",6055564.3600000031,null,"High Schools",13036976,{"$f":"RANK(AS12,$AS$10:$AS$14,0)","v":1},3,6518488]
[null,null,null,null,null,null,null,null,null,null,null,null,null,null,null,null,null,null,null,null,null,null,null,null,null,null,null,null,null,null,null,null,null,null,null,null,null,null,null,null,null,null,null,"Middle Schools",3607370.6700000009,null,"Middle Schools",7937906,{"$f":"RANK(AS13,$AS$10:$AS$14,0)","v":3},4,3968953,null,null,null,null,"Row Labels","Sum of Cost"]
[null,null,null,null,null,null,null,null,null,null,null,null,null,null,null,null,null,null,null,null,null,null,null,null,null,null,null,null,null,null,null,null,null,null,null,null,null,null,null,null,null,null,null,"Special Schools",318337.58999999997,null,"Special Schools",592146,{"$f":"RANK(AS14,$AS$10:$AS$14,0)","v":5},5,296073,null,null,null,null,"Administration",2686228.4799999991]
[null,null,null,null,"Costs per Squ. ft.",null,null,"Consumption",null,null,null,null,null,null,null,null,null,null,null,null,null,null,null,null,null,null,null,null,null,null,null,null,null,null,null,null,null,null,null,null,null,null,null,"Grand Total",18256389.340000004,null,"Grand Total",34897239,null,null,17448619.5,null,null,null,null,"Elementary Schools",5588888.2399999993]
{"$rows_left_out":47}
{"sheet":"Benchmark","index":6,"n_rows":30,"n_cols":15,"rows_kept":30,"cut":false,"hidden":false,"merged":[]}
[]
[]
[]
[null,null,null,"Utility","Electric"]
[]
[null,null,null,"Row Labels","Sum of Area","Sum of kWhC","kWh/SF"]
[null,null,null,"Administration",2499437,26475641,{"$f":"F7/(E7/2)","v":21.185283725895072}]
[null,null,null,"Elementary Schools",10830774,54323729,{"$f":"F8/(E8/2)","v":10.031365994710997}]
[null,null,null,"High Schools",13036976,65028279,9.9759758704779387]
[null,null,null,"Middle Schools",7937906,36210138,9.1233476435724992]
[null,null,null,"Special Schools",592146,3444399,11.633614007356293]
[null,null,null,"Grand Total",34897239,185482186,{"$f":"SUMPRODUCT(G7:G11,E7:E11)/SUM(E7:E11)","v":10.630192606354903},"ALL"]
[null,null,null,null,null,null,{"$f":"SUMPRODUCT(F8:F10,G8:G10)/SUM(F8:F10)","v":9.7968526815960608},"Schools Only"]
[]
[]
{"$rows_left_out":16}
{"sheet":"water","index":7,"n_rows":26,"n_cols":5,"rows_kept":26,"cut":false,"hidden":false,"merged":[]}
["Location:"]
["Time:",null,"Commodity:","Water","Created By:"]
["Year","Use (KGAL)"]
[2019,338486]
[2020,320067]
[2021,345153]
[]
[]
["Location:"]
["Time:",null,"Commodity:","Irrigation","Created By:"]
["Year","Use (KGAL)"]
[2019,90056]
[2020,125084]
[2021,104099]
[]
{"$rows_left_out":12}
{"sheet":"Electric Matt","index":8,"n_rows":31,"n_cols":18,"rows_kept":31,"cut":false,"hidden":false,"merged":[]}
[]
[]
[null,null,null,"Average","Average"]
[null,null,"Avg.","Annual","Annual"]
[null,null,"Sq Feet","Cost/Sq.Ft.","Cost",null,null,null,null,null,null,null,null,"School Type Sorted ","COSTS","%","SQU FT","COST/ ft2"]
[null,"High School",{"$f":"'Dashboard $'!AV26/2/12","v":543207.33333333337},{"$f":"O6/Q6","v":0.69154641843323184},{"$f":"O6/M6","v":375653.08583333337},null,null,null,null,null,null,null,12,"High Schools",{"$f":"O18","v":4507837.03},{"$f":"P18","v":0.33647974894180088},6518488,0.69154641843323184]
[null,"Middle School",{"$f":"'Dashboard $'!AV27/2/18","v":220497.38888888888},{"$f":"O7/Q7","v":0.64955667653408833},{"$f":"O7/M7","v":143225.55111111107},null,null,null,null,null,null,null,18,"Middle Schools",{"$f":"O19","v":2578059.9199999995},0.19243485265005666,3968953,0.64955667653408833]
[null,"Elementary School",{"$f":"'Dashboard $'!AV25/2/57","v":95006.789473684214},{"$f":"O8/Q8","v":0.77563956186326088},{"$f":"O8/M8","v":75006.93571428569},null,null,null,null,null,null,null,56,"Elementary Schools",{"$f":"O20","v":4200388.3999999985},0.31353077426804227,5415387,0.77563956186326088]
[null,"Special School",{"$f":"'ALL Matt'!C9/2/5","v":5921.46},{"$f":"O9/Q9","v":0.89364616158852717},{"$f":"O9/M9","v":52916.9},null,null,null,null,null,null,null,5,"Special Schools",{"$f":"O21","v":264584.5},1.9749455346634817E-2,296073,0.89364616158852717]
[null,null,"Wt. Avg.",{"$f":"SUMPRODUCT(C6:C9,D6:D9)/SUM(C6:C9)","v":0.69146258710582365}]
[]
[]
[]
[]
[]
{"$rows_left_out":17}
{"sheet":"Gas Matt","index":9,"n_rows":21,"n_cols":16,"rows_kept":21,"cut":false,"hidden":false,"merged":[]}
[]
[]
[null,null,null,"Average","Average"]
[null,null,"Avg.","Annual","Annual"]
[null,null,"Sq Feet","Cost/Sq.Ft.","Cost",null,null,null,null,null,null,"School Type Sorted ","COSTS","%","SQU FT","COST/ ft2"]
[null,"High School",{"$f":"'Electric Matt'!C6","v":543207.33333333337},{"$f":"E6/C6","v":4.0651195491960709E-2},{"$f":"M6/K6","v":22082.0275},null,null,null,null,null,12,"High Schools",{"$f":"M18","v":264984.33},{"$f":"N18","v":0.31551162342115791},6518488,4.0651195491960716E-2]
[null,"Middle School",{"$f":"'Electric Matt'!C7","v":220497.38888888888},{"$f":"E7/C7","v":5.1241208290554473E-2},{"$f":"M7/K7","v":11298.552631578947},null,null,null,null,null,19,"Middle Schools",{"$f":"M19","v":214672.5},0.25560631822598162,3968953,5.4087942084474171E-2]
[null,"Elementary School",{"$f":"'Electric Matt'!C8","v":95006.789473684214},{"$f":"E8/C8","v":3.7358298116881697E-2},{"$f":"M8/K8","v":3549.2919642857128},null,null,null,null,null,56,"Elementary Schools",{"$f":"M20","v":198760.34999999992},0.23666003457735602,5415387,3.6702889377989038E-2]
[null,"Special School",{"$f":"'ALL Matt'!C9","v":59214.6},{"$f":"E9/C9","v":6.5228879364210846E-2},{"$f":"M9/K9","v":3862.5019999999995},null,null,null,null,null,5,"Special Schools",{"$f":"M21","v":19312.509999999998},2.2995025337676934E-2,296073,6.5228879364210846E-2]
[null,null,"Wt. Avg.",{"$f":"SUMPRODUCT(C6:C9,D6:D9)/SUM(C6:C9)","v":4.4439714238544821E-2},null,null,null,null,null,null,null,null,{"$f":"SUM(M6:M9)","v":697729.69}]
[]
[]
[]
[]
[]
{"$rows_left_out":7}
{"sheet":"Water Matt","index":10,"n_rows":30,"n_cols":18,"rows_kept":30,"cut":false,"hidden":false,"merged":[]}
[]
[]
[null,null,null,"Average","Average"]
[null,null,"Avg.","Annual","Annual"]
[null,null,"Sq Feet","Cost/Sq.Ft.","Cost",null,null,null,null,null,null,null,null,"School Type Sorted ","COSTS","%","SQU FT","COST/ ft2"]
[null,"High School",{"$f":"'Electric Matt'!C6","v":543207.33333333337},{"$f":"E6/C6","v":0.19678535881327081},{"$f":"O6/M6","v":106895.25},null,null,null,null,null,null,null,12,"High Schools",{"$f":"O16+O22+O28","v":1282743},null,{"$f":"Q16","v":6518488},{"$f":"O6/Q6","v":0.19678535881327081}]
[null,"Middle School",{"$f":"'Electric Matt'!C7","v":220497.38888888888},{"$f":"E7/C7","v":0.1944499097448569},{"$f":"O7/M7","v":42875.697368421053},null,null,null,null,null,null,null,19,"Middle Schools",{"$f":"O17+O23+O29","v":814638.25},null,{"$f":"Q17","v":3968953},{"$f":"O7/Q7","v":0.20525268250846004}]
[null,"Elementary School",{"$f":"'Electric Matt'!C8","v":95006.789473684214},{"$f":"E8/C8","v":0.22361926082765915},{"$f":"O8/M8","v":21245.348035714291},null,null,null,null,null,null,null,56,"Elementary Schools",1189739.4900000002,null,5415387,0.21969611590085811]
[null,"Special School",{"$f":"'ALL Matt'!C9","v":59214.6},{"$f":"E9/C9","v":0.1163246226437399},{"$f":"O9/M9","v":6888.116},null,null,null,null,null,null,null,5,"Special Schools",34440.58,null,296073,{"$f":"O9/Q9","v":0.1163246226437399}]
[null,null,"Wt. Avg.",{"$f":"SUMPRODUCT(C6:C9,D6:D9)/SUM(C6:C9)","v":0.19381125467217575},null,null,null,null,null,null,null,null,null,null,null,null,{"$f":"SUM(Q6:Q9)","v":16198901}]
[]
[]
[]
[]
[]
{"$rows_left_out":16}
{"sheet":"ALL Matt","index":11,"n_rows":27,"n_cols":18,"rows_kept":27,"cut":false,"hidden":false,"merged":[]}
[]
[]
[null,null,null,"Average","Average"]
[null,null,"Avg.","Annual","Annual"]
[null,null,"Sq Feet","Cost/Sq.Ft.","Cost",null,null,null,null,null,null,null,null,"School Type Sorted ","COSTS","%","SQU FT","COST/ ft2"]
[null,"High School",{"$f":"'Electric Matt'!C6","v":543207.33333333337},{"$f":"E6/C6","v":0.92898297273846364},{"$f":"O6/M6","v":504630.36333333357},null,null,null,null,null,null,null,12,"High Schools",{"$f":"O17","v":6055564.3600000031},{"$f":"P17","v":0.331695625022013},6518488,0.92898297273846375]
[null,"Middle School",{"$f":"'Electric Matt'!C7","v":220497.38888888888},{"$f":"E7/C7","v":0.86106060106770599},{"$f":"O7/M7","v":189861.61421052637},null,null,null,null,null,null,null,19,"Middle Schools",{"$f":"O18","v":3607370.6700000009},0.19759497182055011,3968953,0.90889730112702294]
[null,"Elementary School",{"$f":"'Electric Matt'!C8","v":95006.789473684214},{"$f":"E8/C8","v":1.0504678272696457},{"$f":"O8/M8","v":99801.575714285704},null,null,null,null,null,null,null,56,"Elementary Schools",{"$f":"O19","v":5588888.2399999993},0.3061332796973158,5415387,1.0320385671421082]
[null,"Special School",{"$f":"Q9/M9","v":59214.6},{"$f":"E9/C9","v":1.0751996635964778},{"$f":"O9/M9","v":63667.517999999996},null,null,null,null,null,null,null,5,"Special Schools",{"$f":"O20","v":318337.58999999997},1.7437051215330696E-2,296073,1.0751996635964778]
[null,null,"Wt. Avg.",{"$f":"SUMPRODUCT(C6:C9,D6:D9)/SUM(C6:C9)","v":0.9346733471532116}]
[]
[]
[]
[]
[]
{"$rows_left_out":13}
{"sheet":"%","index":12,"n_rows":42,"n_cols":10,"rows_kept":42,"cut":false,"hidden":false,"merged":[]}
[]
[]
[]
[null,null,null,"Utility","Electric"]
[]
[null,null,null,"Row Labels","Sum of Area","Sum of Mmbtus","kWh/SF"]
[null,null,null,"Administration",2499437,26475641,{"$f":"ROUND((F7/E7*1000000)/3412,1)*2","v":6209}]
[null,null,null,"Elementary Schools",10830774,54323729,{"$f":"ROUND((F8/E8*1000000)/3412,1)*2","v":2940}]
[null,null,null,"High Schools",13036976,65028279,{"$f":"ROUND((F9/E9*1000000)/3412,1)*2","v":2923.8}]
[null,null,null,"Middle Schools",7937906,36210138,{"$f":"ROUND((F10/E10*1000000)/3412,1)*2","v":2674}]
[null,null,null,"Special Schools",592146,3444399,{"$f":"ROUND((F11/E11*1000000)/3412,1)*2","v":3409.6}]
[null,null,null,"Grand Total",34897239,185482186,{"$f":"SUMPRODUCT(G7:G11,E7:E11)/SUM(E7:E11)","v":3115.5453864817218},"ALL"]
[null,null,null,null,null,null,{"$f":"SUMPRODUCT(F8:F10,G8:G10)/SUM(F8:F10)","v":2871.3113433919843},"Schools Only"]
[]
[]
{"$rows_left_out":27}